BDBM191855 US9187428, 83
SMILES: CNC(=O)c1cc(CSc2nc(NC[C@H](O)CO)c(C#N)c(-c3ccccc3)c2C#N)ccn1
InChI Key: InChIKey=UGHXOTLFXUPIFS-KRWDZBQOSA-N
Data: 3 EC50
Activity Spreadsheet -- Enzyme Inhibition Constant Data from BindingDB
Found 3 hits for monomerid = 191855
Trg + Lig
Ki
nM
ΔG°
kcal/mole
IC50
nM
Kd
nM
EC50/IC50
nM
koff
s-1
kon
M-1s-1
pHTemp
°C
Adenosine receptor A1
(Homo sapiens (Human))
BDBM191855
(US9187428, 83)
Show SMILES CNC(=O)c1cc(CSc2nc(NC[C@H](O)CO)c(C#N)c(-c3ccccc3)c2C#N)ccn1 |r|
Show InChI InChI=1S/C24H22N6O3S/c1-27-23(33)20-9-15(7-8-28-20)14-34-24-19(11-26)21(16-5-3-2-4-6-16)18(10-25)22(30-24)29-12-17(32)13-31/h2-9,17,31-32H,12-14H2,1H3,(H,27,33)(H,29,30)/t17-/m0/s1
Reactome pathway
US Patent
n/an/an/an/a 0.200n/an/a7.437
Bayer Intellectual Property GmbH
US Patent
Assay Description
The following test protocol is used for pharmacologically characterizing cells and for the robot-assisted substance screening:The stock cultures ar...
US Patent US9187428 (2015)
BindingDB Entry DOI: 10.7270/Q29Z93Q4
Adenosine receptor A2b
(Homo sapiens (Human))
BDBM191855
(US9187428, 83)
Show SMILES CNC(=O)c1cc(CSc2nc(NC[C@H](O)CO)c(C#N)c(-c3ccccc3)c2C#N)ccn1 |r|
Show InChI InChI=1S/C24H22N6O3S/c1-27-23(33)20-9-15(7-8-28-20)14-34-24-19(11-26)21(16-5-3-2-4-6-16)18(10-25)22(30-24)29-12-17(32)13-31/h2-9,17,31-32H,12-14H2,1H3,(H,27,33)(H,29,30)/t17-/m0/s1
NCI pathway
Reactome pathway
US Patent
n/an/an/an/a 593n/an/a7.437
Bayer Intellectual Property GmbH
US Patent
Assay Description
The following test protocol is used for pharmacologically characterizing cells and for the robot-assisted substance screening:The stock cultures ar...
US Patent US9187428 (2015)
BindingDB Entry DOI: 10.7270/Q29Z93Q4
Adenosine receptor A2a
(Homo sapiens (Human))
BDBM191855
(US9187428, 83)
Show SMILES CNC(=O)c1cc(CSc2nc(NC[C@H](O)CO)c(C#N)c(-c3ccccc3)c2C#N)ccn1 |r|
Show InChI InChI=1S/C24H22N6O3S/c1-27-23(33)20-9-15(7-8-28-20)14-34-24-19(11-26)21(16-5-3-2-4-6-16)18(10-25)22(30-24)29-12-17(32)13-31/h2-9,17,31-32H,12-14H2,1H3,(H,27,33)(H,29,30)/t17-/m0/s1
NCI pathway
Reactome pathway
US Patent
n/an/an/an/a 2.18E+3n/an/a7.437
Bayer Intellectual Property GmbH
US Patent
Assay Description
The following test protocol is used for pharmacologically characterizing cells and for the robot-assisted substance screening:The stock cultures ar...
US Patent US9187428 (2015)
BindingDB Entry DOI: 10.7270/Q29Z93Q4