BDBM192228 US9187441, 7S
SMILES: CC(C)(C)NC(=O)C(N(Cc1cc(F)c(F)c(F)c1F)C=O)c1c([nH]c2cc(Cl)ccc12)C(O)=O
InChI Key:
Data: 1 KI
Activity Spreadsheet -- Enzyme Inhibition Constant Data from BindingDB
Found 1 hit for monomerid = 192228
Trg + Lig
Ki
nM
ΔG°
kcal/mole
IC50
nM
Kd
nM
EC50/IC50
nM
koff
s-1
kon
M-1s-1
pHTemp
°C
E3 ubiquitin-protein ligase Mdm2
(Homo sapiens (Human))
BDBM192228
(US9187441, 7S)
Show SMILES CC(C)(C)NC(=O)C(N(Cc1cc(F)c(F)c(F)c1F)C=O)c1c([nH]c2cc(Cl)ccc12)C(O)=O
NCI pathway
Reactome pathway
US Patent
0.700 -12.3n/an/an/an/an/an/a20
University of Pittsburgh—Of the Commonwealth System of Higher Education
US Patent
Assay Description
Fluorescent polarization experiments were performed as follows. Briefly, the fluorescence polarization experiments were read on an Ultra Evolution 38...
US Patent US9187441 (2015)
BindingDB Entry DOI: 10.7270/Q2DR2T9N