BDBM192364 US9187462, I-44
SMILES: COc1ccc(cc1Cl)[C@H](NC(=O)c1ccc2cnc(NC3CCOCC3)nc2c1)c1cnn(C)c1
InChI Key: InChIKey=LZHGVCWCMKIINY-DEOSSOPVSA-N
Data: 1 IC50
Activity Spreadsheet -- Enzyme Inhibition Constant Data from BindingDB
Found 1 hit for monomerid = 192364
Trg + Lig
Ki
nM
ΔG°
kcal/mole
IC50
nM
Kd
nM
EC50/IC50
nM
koff
s-1
kon
M-1s-1
pHTemp
°C
Mitogen-activated protein kinase 1 [8-360]
(Homo sapiens (Human))
BDBM192364
(US9187462, I-44)
Show SMILES COc1ccc(cc1Cl)[C@H](NC(=O)c1ccc2cnc(NC3CCOCC3)nc2c1)c1cnn(C)c1 |r|
Show InChI InChI=1S/C26H27ClN6O3/c1-33-15-19(14-29-33)24(16-5-6-23(35-2)21(27)11-16)32-25(34)17-3-4-18-13-28-26(31-22(18)12-17)30-20-7-9-36-10-8-20/h3-6,11-15,20,24H,7-10H2,1-2H3,(H,32,34)(H,28,30,31)/t24-/m0/s1
US Patent
n/an/a 1n/an/an/an/a7.3n/a
Array BioPharma Inc.; Genentech, Inc.
US Patent
Assay Description
Compounds were tested in an enzymatic assay using human ERK-2 (Mitogen Activated Kinase 1), recombinantly expressed as an N-terminal 6-His fusion pro...
US Patent US9187462 (2015)
BindingDB Entry DOI: 10.7270/Q21G0K2P