BDBM192381 US9187462, I-61
SMILES: COc1ccc(cc1F)[C@H](NC(=O)c1cc(F)c2cnc(N[C@@H]3CCOC3)nc2c1)c1cnn(C)c1
InChI Key: InChIKey=UEOXRBXYKVEYEB-HXOBKFHXSA-N
Data: 1 IC50
Activity Spreadsheet -- Enzyme Inhibition Constant Data from BindingDB
Found 1 hit for monomerid = 192381
Trg + Lig
Ki
nM
ΔG°
kcal/mole
IC50
nM
Kd
nM
EC50/IC50
nM
koff
s-1
kon
M-1s-1
pHTemp
°C
Mitogen-activated protein kinase 1 (aa 8-360)
(Homo sapiens (Human))
BDBM192381
(US9187462, I-61)
Show SMILES COc1ccc(cc1F)[C@H](NC(=O)c1cc(F)c2cnc(N[C@@H]3CCOC3)nc2c1)c1cnn(C)c1 |r|
Show InChI InChI=1S/C25H24F2N6O3/c1-33-12-16(10-29-33)23(14-3-4-22(35-2)20(27)7-14)32-24(34)15-8-19(26)18-11-28-25(31-21(18)9-15)30-17-5-6-36-13-17/h3-4,7-12,17,23H,5-6,13H2,1-2H3,(H,32,34)(H,28,30,31)/t17-,23+/m1/s1
US Patent
n/an/a 2n/an/an/an/a7.3n/a
Array BioPharma Inc.; Genentech, Inc.
US Patent
Assay Description
Compounds were tested in an enzymatic assay using human ERK-2 (Mitogen Activated Kinase 1), recombinantly expressed as an N-terminal 6-His fusion pro...
US Patent US9187462 (2015)
BindingDB Entry DOI: 10.7270/Q21G0K2P