null
SMILES: Clc1cc(Cl)c(cc1Cl)S(=O)(=O)Nc1ccc(cc1)C(c1c[nH]c2ccc(Br)cc12)c1c[nH]c2ccc(Br)cc12
InChI Key: InChIKey=ZKOXDWACIZFCDW-UHFFFAOYSA-N
Activity Spreadsheet -- Enzyme Inhibition Constant Data from BindingDB
Found 1 hit for monomerid = 193796
Trg + Lig
Ki
nM
ΔG°
kcal/mole
IC50
nM
Kd
nM
EC50/IC50
nM
koff
s-1
kon
M-1s-1
pHTemp
°C
Carbonic anhydrase 2
(Bos taurus)
BDBM193796
(N-(4-(bis(5-bromo-1H-indol-3-yl)methyl)phenyl)-2,4...)
Show SMILES Clc1cc(Cl)c(cc1Cl)S(=O)(=O)Nc1ccc(cc1)C(c1c[nH]c2ccc(Br)cc12)c1c[nH]c2ccc(Br)cc12
Show InChI InChI=1S/C29H18Br2Cl3N3O2S/c30-16-3-7-26-19(9-16)21(13-35-26)29(22-14-36-27-8-4-17(31)10-20(22)27)15-1-5-18(6-2-15)37-40(38,39)28-12-24(33)23(32)11-25(28)34/h1-14,29,35-37H
n/an/a 4.03E+4n/an/an/an/a7.2n/a
Universiti Teknologi MARA (UiTM)
Assay Description
This was assay performed using buffer containing Tris and HEPES at the pH of 7.2-7.9 and a total concentration of 20 mM. 96-well plates were filled w...
Bioorg Chem 68: 90-104 (2016)
Article DOI: 10.1016/j.bioorg.2016.07.011
BindingDB Entry DOI: 10.7270/Q2CJ8C95