null
SMILES: Oc1c(Cl)cc(Cl)cc1S(=O)(=O)Nc1ccc(cc1)C(c1c[nH]c2ccc(Br)cc12)c1c[nH]c2ccc(Br)cc12
InChI Key: InChIKey=ZDTKMYXGIFOHQV-UHFFFAOYSA-N
Activity Spreadsheet -- Enzyme Inhibition Constant Data from BindingDB
Found 1 hit for monomerid = 193801
Trg + Lig
Ki
nM
ΔG°
kcal/mole
IC50
nM
Kd
nM
EC50/IC50
nM
koff
s-1
kon
M-1s-1
pHTemp
°C
Carbonic anhydrase 2
(Bos taurus)
BDBM193801
(N-(4-(bis(5-bromo-1H-indol-3-yl)methyl)phenyl)-3,5...)
Show SMILES Oc1c(Cl)cc(Cl)cc1S(=O)(=O)Nc1ccc(cc1)C(c1c[nH]c2ccc(Br)cc12)c1c[nH]c2ccc(Br)cc12
Show InChI InChI=1S/C29H19Br2Cl2N3O3S/c30-16-3-7-25-20(9-16)22(13-34-25)28(23-14-35-26-8-4-17(31)10-21(23)26)15-1-5-19(6-2-15)36-40(38,39)27-12-18(32)11-24(33)29(27)37/h1-14,28,34-37H
n/an/a 1.88E+4n/an/an/an/a7.2n/a
Universiti Teknologi MARA (UiTM)
Assay Description
This was assay performed using buffer containing Tris and HEPES at the pH of 7.2-7.9 and a total concentration of 20 mM. 96-well plates were filled w...
Bioorg Chem 68: 90-104 (2016)
Article DOI: 10.1016/j.bioorg.2016.07.011
BindingDB Entry DOI: 10.7270/Q2CJ8C95