BDBM19433 2-[3-(4-chlorophenyl)-4-(pyridin-4-yl)-1H-pyrazol-5-yl]-decahydroisoquinoline::Pyrazole-Based Inhibitor, 14
SMILES: Clc1ccc(cc1)-c1n[nH]c(N2CCC3CCCCC3C2)c1-c1ccncc1
InChI Key: InChIKey=YPRJIJRXHSOAKK-UHFFFAOYSA-N
Data: 1 IC50
Activity Spreadsheet -- Enzyme Inhibition Constant Data from BindingDB
Found 1 hit for monomerid = 19433
Trg + Lig
Ki
nM
ΔG°
kcal/mole
IC50
nM
Kd
nM
EC50/IC50
nM
koff
s-1
kon
M-1s-1
pHTemp
°C
Mitogen-activated protein kinase 14
(Homo sapiens (Human))
BDBM19433
(2-[3-(4-chlorophenyl)-4-(pyridin-4-yl)-1H-pyrazol-...)
Show SMILES Clc1ccc(cc1)-c1n[nH]c(N2CCC3CCCCC3C2)c1-c1ccncc1 |w:14.15,19.19|
Show InChI InChI=1S/C23H25ClN4/c24-20-7-5-18(6-8-20)22-21(17-9-12-25-13-10-17)23(27-26-22)28-14-11-16-3-1-2-4-19(16)15-28/h5-10,12-13,16,19H,1-4,11,14-15H2,(H,26,27)
NCI pathway
Reactome pathway
n/an/a 260n/an/an/an/a7.530
Pfizer
Assay Description
Kinase activity was assayed in reaction buffer containing substrate, enzyme, and inhibitor in the presence of 50 uM ATP/[gamma-33P] ATP. 33P incorpor...
J Med Chem 50: 5712-9 (2007)
Article DOI: 10.1021/jm0611915
BindingDB Entry DOI: 10.7270/Q20G3HD5