BDBM19435 1-[3-(4-chlorophenyl)-4-(pyridin-4-yl)-1H-pyrazol-5-yl]-decahydroquinoline::Pyrazole-Based Inhibitor, 16
SMILES: Clc1ccc(cc1)-c1n[nH]c(N2CCCC3CCCCC23)c1-c1ccncc1
InChI Key: InChIKey=ZOXBZBPUCXTGNN-UHFFFAOYSA-N
Data: 1 IC50
Activity Spreadsheet -- Enzyme Inhibition Constant Data from BindingDB
Found 1 hit for monomerid = 19435
Trg + Lig
Ki
nM
ΔG°
kcal/mole
IC50
nM
Kd
nM
EC50/IC50
nM
koff
s-1
kon
M-1s-1
pHTemp
°C
Mitogen-activated protein kinase 14
(Homo sapiens (Human))
BDBM19435
(1-[3-(4-chlorophenyl)-4-(pyridin-4-yl)-1H-pyrazol-...)
Show SMILES Clc1ccc(cc1)-c1n[nH]c(N2CCCC3CCCCC23)c1-c1ccncc1 |w:19.20,15.16|
Show InChI InChI=1S/C23H25ClN4/c24-19-9-7-18(8-10-19)22-21(17-11-13-25-14-12-17)23(27-26-22)28-15-3-5-16-4-1-2-6-20(16)28/h7-14,16,20H,1-6,15H2,(H,26,27)
NCI pathway
Reactome pathway
n/an/a 40n/an/an/an/a7.530
Pfizer
Assay Description
Kinase activity was assayed in reaction buffer containing substrate, enzyme, and inhibitor in the presence of 50 uM ATP/[gamma-33P] ATP. 33P incorpor...
J Med Chem 50: 5712-9 (2007)
Article DOI: 10.1021/jm0611915
BindingDB Entry DOI: 10.7270/Q20G3HD5