BDBM19436 1-[3-(4-chlorophenyl)-4-(pyridin-4-yl)-1H-pyrazol-5-yl]piperidin-3-ol::Pyrazole-Based Inhibitor, 17
SMILES: OC1CCCN(C1)c1[nH]nc(c1-c1ccncc1)-c1ccc(Cl)cc1
InChI Key: InChIKey=ZBHQRYHFJRDCMN-UHFFFAOYSA-N
Data: 1 IC50
Activity Spreadsheet -- Enzyme Inhibition Constant Data from BindingDB
Found 1 hit for monomerid = 19436
Trg + Lig
Ki
nM
ΔG°
kcal/mole
IC50
nM
Kd
nM
EC50/IC50
nM
koff
s-1
kon
M-1s-1
pHTemp
°C
Mitogen-activated protein kinase 14
(Homo sapiens (Human))
BDBM19436
(1-[3-(4-chlorophenyl)-4-(pyridin-4-yl)-1H-pyrazol-...)
Show SMILES OC1CCCN(C1)c1[nH]nc(c1-c1ccncc1)-c1ccc(Cl)cc1
Show InChI InChI=1S/C19H19ClN4O/c20-15-5-3-14(4-6-15)18-17(13-7-9-21-10-8-13)19(23-22-18)24-11-1-2-16(25)12-24/h3-10,16,25H,1-2,11-12H2,(H,22,23)
NCI pathway
Reactome pathway
n/an/a 190n/an/an/an/a7.530
Pfizer
Assay Description
Kinase activity was assayed in reaction buffer containing substrate, enzyme, and inhibitor in the presence of 50 uM ATP/[gamma-33P] ATP. 33P incorpor...
J Med Chem 50: 5712-9 (2007)
Article DOI: 10.1021/jm0611915
BindingDB Entry DOI: 10.7270/Q20G3HD5