BDBM19438 4-{5-[(8aS)-octahydropyrrolo[1,2-a]piperazin-2-yl]-3-(4-chlorophenyl)-1H-pyrazol-4-yl}pyridine::Pyrazole-Based Inhibitor, 19
SMILES: Clc1ccc(cc1)-c1n[nH]c(N2CCN3CCC[C@H]3C2)c1-c1ccncc1
InChI Key: InChIKey=AKMUGCMCOYELTD-SFHVURJKSA-N
Data: 1 IC50
Activity Spreadsheet -- Enzyme Inhibition Constant Data from BindingDB
Found 1 hit for monomerid = 19438
Trg + Lig
Ki
nM
ΔG°
kcal/mole
IC50
nM
Kd
nM
EC50/IC50
nM
koff
s-1
kon
M-1s-1
pHTemp
°C
Mitogen-activated protein kinase 14
(Homo sapiens (Human))
BDBM19438
(4-{5-[(8aS)-octahydropyrrolo[1,2-a]piperazin-2-yl]...)
Show SMILES Clc1ccc(cc1)-c1n[nH]c(N2CCN3CCC[C@H]3C2)c1-c1ccncc1 |r|
Show InChI InChI=1S/C21H22ClN5/c22-17-5-3-16(4-6-17)20-19(15-7-9-23-10-8-15)21(25-24-20)27-13-12-26-11-1-2-18(26)14-27/h3-10,18H,1-2,11-14H2,(H,24,25)/t18-/m0/s1
NCI pathway
Reactome pathway
n/an/a 62n/an/an/an/a7.530
Pfizer
Assay Description
Kinase activity was assayed in reaction buffer containing substrate, enzyme, and inhibitor in the presence of 50 uM ATP/[gamma-33P] ATP. 33P incorpor...
J Med Chem 50: 5712-9 (2007)
Article DOI: 10.1021/jm0611915
BindingDB Entry DOI: 10.7270/Q20G3HD5