BDBM194573 US9205085, MSX- 207
SMILES: FCc1ccc(CNc2ncccn2)cc1
InChI Key: InChIKey=VIIJEINJWVDDFS-UHFFFAOYSA-N
Data: 1 IC50
Activity Spreadsheet -- Enzyme Inhibition Constant Data from BindingDB
Found 1 hit for monomerid = 194573
Trg + Lig
Ki
nM
ΔG°
kcal/mole
IC50
nM
Kd
nM
EC50/IC50
nM
koff
s-1
kon
M-1s-1
pHTemp
°C
C-X-C chemokine receptor type 4 (CXCR4/SDF-1)
(Rattus norvegicus (Rat))
BDBM194573
(US9205085, MSX- 207)
Show SMILES FCc1ccc(CNc2ncccn2)cc1
Show InChI InChI=1S/C12H12FN3/c13-8-10-2-4-11(5-3-10)9-16-12-14-6-1-7-15-12/h1-7H,8-9H2,(H,14,15,16)
US Patent
n/an/a 1n/an/an/an/an/an/a
Emory University
US Patent
Assay Description
A synthetic 14-mer peptide, TN14003, was previously reported to block both SDF-1/CXCR4 mediated invasion in vitro and metastasis in vivo with a high ...
US Patent US9205085 (2015)
BindingDB Entry DOI: 10.7270/Q2FF3R5M