null
SMILES: Nc1c(cc(c2ccccc12)S(=O)(=O)O[Na])\N=N\c1ccc(nc1)-c1ccccc1OCCCCCCO
InChI Key: InChIKey=NYQMDLUFBJFIIO-FJISBNMDSA-M
Activity Spreadsheet -- Enzyme Inhibition Constant Data from BindingDB
Found 1 hit for monomerid = 194626
Trg + Lig
Ki
nM
ΔG°
kcal/mole
IC50
nM
Kd
nM
EC50/IC50
nM
koff
s-1
kon
M-1s-1
pHTemp
°C
Transitional endoplasmic reticulum ATPase
(Mus musculus (Mouse))
BDBM194626
(US9206129, 42)
Show SMILES Nc1c(cc(c2ccccc12)S(=O)(=O)O[Na])\N=N\c1ccc(nc1)-c1ccccc1OCCCCCCO
Show InChI InChI=1S/C27H28N4O5S.Na/c28-27-21-10-4-3-9-20(21)26(37(33,34)35)17-24(27)31-30-19-13-14-23(29-18-19)22-11-5-6-12-25(22)36-16-8-2-1-7-15-32;/h3-6,9-14,17-18,32H,1-2,7-8,15-16,28H2,(H,33,34,35);/q;+1/p-1/b31-30+;
US Patent
n/an/a 324n/an/an/an/a8.037
Daito Chemix Corporation; Kyoto University
US Patent
Assay Description
Mouse VCP cDNA was added with a DNA sequence corresponding to histidine tag at the amino-terminal, subcloned into a baculovirus vector pVL1392 (BD Bi...
US Patent US9206129 (2015)
BindingDB Entry DOI: 10.7270/Q29P30GQ