BDBM19474 1-(4-chlorophenyl)-1H-imidazole::1-(4-chlorophenyl)imidazole::1-CPI
SMILES: Clc1ccc(cc1)-n1ccnc1
InChI Key: InChIKey=BARLRKAYTDVUIS-UHFFFAOYSA-N
Data: 2 ITC
PDB links: 2 PDB IDs match this monomer.
Activity Spreadsheet -- ITC Data from BindingDB
Found 2 hits for monomerid = 19474
Cell (A)Syringe (B)Cell
Syringe
Cell + Syr
ΔG°
kcal/mole
-TΔS°
kcal/mole
ΔH°
kcal/mole
log KpHTemp
°C
Cytochrome P450 2B4 Mutant (F206A)
(Oryctolagus cuniculus (rabbit))
BDBM19474
JPEG
(1-(4-chlorophenyl)-1H-imidazole | 1-(4-chloropheny...)
n/a3.30-10.95.597.4025
Anhui Medical University
Zhonghua Wai Ke Za Zhi 41: 186-8 (2003)
Cytochrome P450 2B4
(Oryctolagus cuniculus)
BDBM19474
JPEG
(1-(4-chlorophenyl)-1H-imidazole | 1-(4-chloropheny...)
n/a0.0997-8.145.907.4025
Anhui Medical University
Zhonghua Wai Ke Za Zhi 41: 186-8 (2003)