BDBM194760 US9206167, 81
SMILES: CC(=O)N1CCc2ccc(OCCCN3CCN(CC3)c3cccc4sccc34)cc2C1
InChI Key: InChIKey=DNHQZUHOZJMFSD-UHFFFAOYSA-N
Data: 2 KI
Activity Spreadsheet -- Enzyme Inhibition Constant Data from BindingDB
Found 2 hits for monomerid = 194760
Trg + Lig
Ki
nM
ΔG°
kcal/mole
IC50
nM
Kd
nM
EC50/IC50
nM
koff
s-1
kon
M-1s-1
pHTemp
°C
D(2) dopamine receptor
(Rattus norvegicus (rat))
BDBM194760
(US9206167, 81)
Show SMILES CC(=O)N1CCc2ccc(OCCCN3CCN(CC3)c3cccc4sccc34)cc2C1
Show InChI InChI=1S/C26H31N3O2S/c1-20(30)29-11-8-21-6-7-23(18-22(21)19-29)31-16-3-10-27-12-14-28(15-13-27)25-4-2-5-26-24(25)9-17-32-26/h2,4-7,9,17-18H,3,8,10-16,19H2,1H3
Reactome pathway
US Patent
0.800 -12.4n/an/an/an/an/a7.425
OTSUKA PHARMACEUTICAL CO., LTD.
US Patent
Assay Description
The assay was performed according to the method by Kohler et al. (Kohler C, Hall H, Ogren S O and Gawell L, Specific in vitro and in vivo binding of ...
US Patent US9206167 (2015)
BindingDB Entry DOI: 10.7270/Q2XD10GS
5-hydroxytryptamine receptor 2A
(Rattus norvegicus (rat))
BDBM194760
(US9206167, 81)
Show SMILES CC(=O)N1CCc2ccc(OCCCN3CCN(CC3)c3cccc4sccc34)cc2C1
Show InChI InChI=1S/C26H31N3O2S/c1-20(30)29-11-8-21-6-7-23(18-22(21)19-29)31-16-3-10-27-12-14-28(15-13-27)25-4-2-5-26-24(25)9-17-32-26/h2,4-7,9,17-18H,3,8,10-16,19H2,1H3
Reactome pathway
US Patent
2.60 -12.2n/an/an/an/an/a7.437
OTSUKA PHARMACEUTICAL CO., LTD.
US Patent
Assay Description
The assay was performed according to the method by Leysen J E et al. (Leysen J E, Niemegeers C J E, Van Nueten J M and Laduron P M. [3H] Ketanserin (...
US Patent US9206167 (2015)
BindingDB Entry DOI: 10.7270/Q2XD10GS