null
SMILES: O=C1CCc2ccc(OCCCN3CCN(CC3)c3cccc4sccc34)cc2N1
InChI Key: InChIKey=OESURDJKQAMNOQ-UHFFFAOYSA-N
Activity Spreadsheet -- Enzyme Inhibition Constant Data from BindingDB
Found 4 hits for monomerid = 194789
Trg + Lig
Ki
nM
ΔG°
kcal/mole
IC50
nM
Kd
nM
EC50/IC50
nM
koff
s-1
kon
M-1s-1
pHTemp
°C
D(2) dopamine receptor
(Rattus norvegicus (rat))
BDBM194789
(US9206167, 10 | USRE48059, Compound of Example 10)
Show SMILES O=C1CCc2ccc(OCCCN3CCN(CC3)c3cccc4sccc34)cc2N1
Show InChI InChI=1S/C24H27N3O2S/c28-24-8-6-18-5-7-19(17-21(18)25-24)29-15-2-10-26-11-13-27(14-12-26)22-3-1-4-23-20(22)9-16-30-23/h1,3-5,7,9,16-17H,2,6,8,10-15H2,(H,25,28)
Reactome pathway
US Patent
0.400n/an/an/an/an/an/an/an/a
Otsuka Pharmaceutical Co., Ltd.
US Patent
Assay Description
Dopamine D2: The binding assay was performed using 40 μl of the membrane specimen, 20 μl of [3H]-raclopride (final concentration 1 to 2 nM)...
US Patent USRE48059 (2020)
D(2) dopamine receptor
(Rattus norvegicus (rat))
BDBM194789
(US9206167, 10 | USRE48059, Compound of Example 10)
Show SMILES O=C1CCc2ccc(OCCCN3CCN(CC3)c3cccc4sccc34)cc2N1
Show InChI InChI=1S/C24H27N3O2S/c28-24-8-6-18-5-7-19(17-21(18)25-24)29-15-2-10-26-11-13-27(14-12-26)22-3-1-4-23-20(22)9-16-30-23/h1,3-5,7,9,16-17H,2,6,8,10-15H2,(H,25,28)
Reactome pathway
US Patent
0.400 -12.8n/an/an/an/an/a7.425
OTSUKA PHARMACEUTICAL CO., LTD.
US Patent
Assay Description
The assay was performed according to the method by Kohler et al. (Kohler C, Hall H, Ogren S O and Gawell L, Specific in vitro and in vivo binding of ...
US Patent US9206167 (2015)
BindingDB Entry DOI: 10.7270/Q2XD10GS
5-hydroxytryptamine receptor 2A
(Rattus norvegicus (rat))
BDBM194789
(US9206167, 10 | USRE48059, Compound of Example 10)
Show SMILES O=C1CCc2ccc(OCCCN3CCN(CC3)c3cccc4sccc34)cc2N1
Show InChI InChI=1S/C24H27N3O2S/c28-24-8-6-18-5-7-19(17-21(18)25-24)29-15-2-10-26-11-13-27(14-12-26)22-3-1-4-23-20(22)9-16-30-23/h1,3-5,7,9,16-17H,2,6,8,10-15H2,(H,25,28)
Reactome pathway
US Patent
3n/an/an/an/an/an/an/an/a
Otsuka Pharmaceutical Co., Ltd.
US Patent
Assay Description
5-HT2A: The binding assay was performed using 40 μl of the membrane specimen, 20 μl of [3H]-Ketanserin (final concentration 1 to 3 nM), 20 ...
US Patent USRE48059 (2020)
5-hydroxytryptamine receptor 2A
(Rattus norvegicus (rat))
BDBM194789
(US9206167, 10 | USRE48059, Compound of Example 10)
Show SMILES O=C1CCc2ccc(OCCCN3CCN(CC3)c3cccc4sccc34)cc2N1
Show InChI InChI=1S/C24H27N3O2S/c28-24-8-6-18-5-7-19(17-21(18)25-24)29-15-2-10-26-11-13-27(14-12-26)22-3-1-4-23-20(22)9-16-30-23/h1,3-5,7,9,16-17H,2,6,8,10-15H2,(H,25,28)
Reactome pathway
US Patent
3 -12.1n/an/an/an/an/a7.437
OTSUKA PHARMACEUTICAL CO., LTD.
US Patent
Assay Description
The assay was performed according to the method by Leysen J E et al. (Leysen J E, Niemegeers C J E, Van Nueten J M and Laduron P M. [3H] Ketanserin (...
US Patent US9206167 (2015)
BindingDB Entry DOI: 10.7270/Q2XD10GS