BDBM194844 US9206184, 25
SMILES: COc1cc(C)cc2cc(sc12)-c1c(COCC2CC2)c(CN2CCNCC2)n2ncnc(N)c12
InChI Key: InChIKey=WAZQJIQKCRAOBX-UHFFFAOYSA-N
Data: 2 IC50
Activity Spreadsheet -- Enzyme Inhibition Constant Data from BindingDB
Found 2 hits for monomerid = 194844
Trg + Lig
Ki
nM
ΔG°
kcal/mole
IC50
nM
Kd
nM
EC50/IC50
nM
koff
s-1
kon
M-1s-1
pHTemp
°C
Fibroblast growth factor receptor 3
(Homo sapiens (Human))
BDBM194844
(US9206184, 25)
Show SMILES COc1cc(C)cc2cc(sc12)-c1c(COCC2CC2)c(CN2CCNCC2)n2ncnc(N)c12
Show InChI InChI=1S/C26H32N6O2S/c1-16-9-18-11-22(35-25(18)21(10-16)33-2)23-19(14-34-13-17-3-4-17)20(12-31-7-5-28-6-8-31)32-24(23)26(27)29-15-30-32/h9-11,15,17,28H,3-8,12-14H2,1-2H3,(H2,27,29,30)
Reactome pathway
US Patent
n/an/a 5.20n/an/an/an/a7.022
BAYER INTELLECTUAL PROPERTY GmbH
US Patent
Assay Description
For the assay, 50 nl of each stock solution of the test compound in DMSO was pipetted into a black, low-volume 384-well microtiter plate (Greiner Bio...
US Patent US9206184 (2015)
BindingDB Entry DOI: 10.7270/Q2SN07SH
Fibroblast growth factor receptor 1
(Homo sapiens (Human))
BDBM194844
(US9206184, 25)
Show SMILES COc1cc(C)cc2cc(sc12)-c1c(COCC2CC2)c(CN2CCNCC2)n2ncnc(N)c12
Show InChI InChI=1S/C26H32N6O2S/c1-16-9-18-11-22(35-25(18)21(10-16)33-2)23-19(14-34-13-17-3-4-17)20(12-31-7-5-28-6-8-31)32-24(23)26(27)29-15-30-32/h9-11,15,17,28H,3-8,12-14H2,1-2H3,(H2,27,29,30)
NCI pathway
Reactome pathway
US Patent
n/an/a 0.700n/an/an/an/a7.022
BAYER INTELLECTUAL PROPERTY GmbH
US Patent
Assay Description
For the assay, 50 nl of each stock solution of the test compound in DMSO was pipetted into a black, low-volume 384-well microtiter plate (Greiner Bio...
US Patent US9206184 (2015)
BindingDB Entry DOI: 10.7270/Q2SN07SH