BDBM195117 US10336717, Compound 177::US9212153, 177,Ex. 138
SMILES:
InChI Key: InChIKey=ZGMXAXRVEMIDBS-UHFFFAOYSA-N
Data: 2 IC50
Activity Spreadsheet -- Enzyme Inhibition Constant Data from BindingDB
Found 2 hits for monomerid = 195117
Trg + Lig
Ki
nM
ΔG°
kcal/mole
IC50
nM
Kd
nM
EC50/IC50
nM
koff
s-1
kon
M-1s-1
pHTemp
°C
Beta-secretase 1
(Homo sapiens (Human))
BDBM195117
(US10336717, Compound 177 | US9212153, 177,Ex. 138)
Show InChI InChI=1S/C24H26ClN3O2/c1-28-21(29)24(27-22(28)26)20-13-16(15-4-3-5-18(25)12-15)6-7-17(20)14-23(24)10-8-19(30-2)9-11-23/h3-7,12-13,19H,8-11,14H2,1-2H3,(H2,26,27)
PCBioAssay
n/an/a 1.5n/an/an/an/an/an/a
SRMLSC
Curated by PubChem BioAssay
Assay Description
For each compound being tested, the BACE activity was monitored in a fluorescence quenching assay (FRET) using the ectodomain of BACE (aa 1-454) fuse...
PubChem Bioassay (2007)
BindingDB Entry DOI: 10.7270/Q2WH2NCD
Beta-secretase 1 (aa 1-458)
(Homo sapiens (Human))
BDBM195117
(US10336717, Compound 177 | US9212153, 177,Ex. 138)
Show InChI InChI=1S/C24H26ClN3O2/c1-28-21(29)24(27-22(28)26)20-13-16(15-4-3-5-18(25)12-15)6-7-17(20)14-23(24)10-8-19(30-2)9-11-23/h3-7,12-13,19H,8-11,14H2,1-2H3,(H2,26,27)
US Patent
n/an/a 1.5n/an/an/an/a4.4n/a
Vitae Pharmaceuticals, Inc.; Boehringer Ingelheim International GmbH
US Patent
Assay Description
For each compound being tested, the BACE activity was monitored in a fluorescence quenching assay (FRET) using the ectodomain of BACE (aa 1-454) fuse...
US Patent US9212153 (2015)
BindingDB Entry DOI: 10.7270/Q2J67FRJ