BDBM195119 US10336717, Compound 179::US9212153, 179,Ex. 140
SMILES:
InChI Key: InChIKey=NGDMMAMORNIVDN-UHFFFAOYSA-N
Data: 2 IC50
Activity Spreadsheet -- Enzyme Inhibition Constant Data from BindingDB
Found 2 hits for monomerid = 195119
Trg + Lig
Ki
nM
ΔG°
kcal/mole
IC50
nM
Kd
nM
EC50/IC50
nM
koff
s-1
kon
M-1s-1
pHTemp
°C
Beta-secretase 1
(Homo sapiens (Human))
BDBM195119
(US10336717, Compound 179 | US9212153, 179,Ex. 140)
Show InChI InChI=1S/C25H25FN4O2/c1-30-22(31)25(29-23(30)28)20-12-16(15-5-6-21(26)18(11-15)14-27)3-4-17(20)13-24(25)9-7-19(32-2)8-10-24/h3-6,11-12,19H,7-10,13H2,1-2H3,(H2,28,29)
PCBioAssay
n/an/a 2.60n/an/an/an/an/an/a
SRMLSC
Curated by PubChem BioAssay
Assay Description
For each compound being tested, the BACE activity was monitored in a fluorescence quenching assay (FRET) using the ectodomain of BACE (aa 1-454) fuse...
PubChem Bioassay (2007)
BindingDB Entry DOI: 10.7270/Q2WH2NCD
Beta-secretase 1 (aa 1-458)
(Homo sapiens (Human))
BDBM195119
(US10336717, Compound 179 | US9212153, 179,Ex. 140)
Show InChI InChI=1S/C25H25FN4O2/c1-30-22(31)25(29-23(30)28)20-12-16(15-5-6-21(26)18(11-15)14-27)3-4-17(20)13-24(25)9-7-19(32-2)8-10-24/h3-6,11-12,19H,7-10,13H2,1-2H3,(H2,28,29)
US Patent
n/an/a 2.60n/an/an/an/a4.525
Vitae Pharmaceuticals, Inc.; Boehringer Ingelheim International GmbH
US Patent
Assay Description
Inhibitory activity of compounds was assessed by a fluorescence quench assay of BACE activity using commercially available substrate HiLyte Fluor 488...
US Patent US9212153 (2015)
BindingDB Entry DOI: 10.7270/Q2J67FRJ