BDBM195124 US9212153, 184,Ex. 145
SMILES:
InChI Key: InChIKey=PNBXBKXPZDFHIM-UHFFFAOYSA-N
Data: 1 IC50
Activity Spreadsheet -- Enzyme Inhibition Constant Data from BindingDB
Found 1 hit for monomerid = 195124
Trg + Lig
Ki
nM
ΔG°
kcal/mole
IC50
nM
Kd
nM
EC50/IC50
nM
koff
s-1
kon
M-1s-1
pHTemp
°C
Beta-secretase 1 (aa 1-458)
(Homo sapiens (Human))
BDBM195124
(US9212153, 184,Ex. 145)
Show InChI InChI=1S/C23H26N4O2/c1-27-20(28)23(26-21(27)24)19-12-15(17-4-3-11-25-14-17)5-6-16(19)13-22(23)9-7-18(29-2)8-10-22/h3-6,11-12,14,18H,7-10,13H2,1-2H3,(H2,24,26)
US Patent
n/an/a 3.30n/an/an/an/a4.525
Vitae Pharmaceuticals, Inc.; Boehringer Ingelheim International GmbH
US Patent
Assay Description
Inhibitory activity of compounds was assessed by a fluorescence quench assay of BACE activity using commercially available substrate HiLyte Fluor 488...
US Patent US9212153 (2015)
BindingDB Entry DOI: 10.7270/Q2J67FRJ