BDBM19524 (2S)-N-(cyanomethyl)-4-methyl-2-{[(1S)-2,2,2-trifluoro-1-[4-(2-fluorophenyl)phenyl]ethyl]amino}pentanamide::trifluoroethylamine analogue, 13
SMILES: CC(C)C[C@H](N[C@@H](c1ccc(cc1)-c1ccccc1F)C(F)(F)F)C(=O)NCC#N
InChI Key: InChIKey=HCERRVOHXYKRJP-PMACEKPBSA-N
Data: 4 IC50
Activity Spreadsheet -- Enzyme Inhibition Constant Data from BindingDB
Found 4 hits for monomerid = 19524
Trg + Lig
Ki
nM
ΔG°
kcal/mole
IC50
nM
Kd
nM
EC50/IC50
nM
koff
s-1
kon
M-1s-1
pHTemp
°C
Cathepsin S
(Homo sapiens (Human))
BDBM19524
((2S)-N-(cyanomethyl)-4-methyl-2-{[(1S)-2,2,2-trifl...)
Show SMILES CC(C)C[C@H](N[C@@H](c1ccc(cc1)-c1ccccc1F)C(F)(F)F)C(=O)NCC#N |r|
Show InChI InChI=1S/C22H23F4N3O/c1-14(2)13-19(21(30)28-12-11-27)29-20(22(24,25)26)16-9-7-15(8-10-16)17-5-3-4-6-18(17)23/h3-10,14,19-20,29H,12-13H2,1-2H3,(H,28,30)/t19-,20-/m0/s1
Reactome pathway
n/an/a 614n/an/an/an/a6.522
Merck Frosst Centre for Therapeutic Research
Assay Description
Prior to the addition of substrate, different concentrations of the inhibitor ranging from 100 uM to 0.2 nM were preincubated for 15 min with enzyme ...
Bioorg Med Chem Lett 16: 1985-9 (2006)
Article DOI: 10.1016/j.bmcl.2005.12.071
BindingDB Entry DOI: 10.7270/Q237770H
Procathepsin L
(Homo sapiens (Human))
BDBM19524
((2S)-N-(cyanomethyl)-4-methyl-2-{[(1S)-2,2,2-trifl...)
Show SMILES CC(C)C[C@H](N[C@@H](c1ccc(cc1)-c1ccccc1F)C(F)(F)F)C(=O)NCC#N |r|
Show InChI InChI=1S/C22H23F4N3O/c1-14(2)13-19(21(30)28-12-11-27)29-20(22(24,25)26)16-9-7-15(8-10-16)17-5-3-4-6-18(17)23/h3-10,14,19-20,29H,12-13H2,1-2H3,(H,28,30)/t19-,20-/m0/s1
Reactome pathway
n/an/a 1.67E+3n/an/an/an/an/an/a
Merck Frosst Centre for Therapeutic Research
Assay Description
Prior to the addition of substrate, different concentrations of the inhibitor ranging from 100 uM to 0.2 nM were preincubated for 15 min with enzyme ...
Bioorg Med Chem Lett 16: 1985-9 (2006)
Article DOI: 10.1016/j.bmcl.2005.12.071
BindingDB Entry DOI: 10.7270/Q237770H
Cathepsin K
(Oryctolagus cuniculus (rabbit))
BDBM19524
((2S)-N-(cyanomethyl)-4-methyl-2-{[(1S)-2,2,2-trifl...)
Show SMILES CC(C)C[C@H](N[C@@H](c1ccc(cc1)-c1ccccc1F)C(F)(F)F)C(=O)NCC#N |r|
Show InChI InChI=1S/C22H23F4N3O/c1-14(2)13-19(21(30)28-12-11-27)29-20(22(24,25)26)16-9-7-15(8-10-16)17-5-3-4-6-18(17)23/h3-10,14,19-20,29H,12-13H2,1-2H3,(H,28,30)/t19-,20-/m0/s1
n/an/a 0.100n/an/an/an/an/an/a
Merck Frosst Centre for Therapeutic Research
Assay Description
Prior to the addition of substrate, different concentrations of the inhibitor ranging from 100 uM to 0.2 nM were preincubated for 15 min with enzyme ...
Bioorg Med Chem Lett 16: 1985-9 (2006)
Article DOI: 10.1016/j.bmcl.2005.12.071
BindingDB Entry DOI: 10.7270/Q237770H
Cathepsin B
(Homo sapiens (Human))
BDBM19524
((2S)-N-(cyanomethyl)-4-methyl-2-{[(1S)-2,2,2-trifl...)
Show SMILES CC(C)C[C@H](N[C@@H](c1ccc(cc1)-c1ccccc1F)C(F)(F)F)C(=O)NCC#N |r|
Show InChI InChI=1S/C22H23F4N3O/c1-14(2)13-19(21(30)28-12-11-27)29-20(22(24,25)26)16-9-7-15(8-10-16)17-5-3-4-6-18(17)23/h3-10,14,19-20,29H,12-13H2,1-2H3,(H,28,30)/t19-,20-/m0/s1
Reactome pathway
n/an/a 6.09E+3n/an/an/an/an/an/a
Merck Frosst Centre for Therapeutic Research
Assay Description
Prior to the addition of substrate, different concentrations of the inhibitor ranging from 100 uM to 0.2 nM were preincubated for 15 min with enzyme ...
Bioorg Med Chem Lett 16: 1985-9 (2006)
Article DOI: 10.1016/j.bmcl.2005.12.071
BindingDB Entry DOI: 10.7270/Q237770H