BDBM195378 US10336717, Compound 462::US9212153, 462,Ex. 396::US9212153, 465,Ex. 399
SMILES: CN1C(N)=NC2(C1=O)c1cc(ccc1CC21CCc2noc(C)c2C1)-c1cccc(c1)C#N
InChI Key: InChIKey=KETJJWVTEIRQBP-UHFFFAOYSA-N
Data: 3 IC50
Activity Spreadsheet -- Enzyme Inhibition Constant Data from BindingDB
Found 3 hits for monomerid = 195378
Trg + Lig
Ki
nM
ΔG°
kcal/mole
IC50
nM
Kd
nM
EC50/IC50
nM
koff
s-1
kon
M-1s-1
pHTemp
°C
Beta-secretase 1 (aa 1-458)
(Homo sapiens (Human))
BDBM195378
(US10336717, Compound 462 | US9212153, 462,Ex. 396 ...)
Show SMILES CN1C(N)=NC2(C1=O)c1cc(ccc1CC21CCc2noc(C)c2C1)-c1cccc(c1)C#N |c:3|
Show InChI InChI=1S/C26H23N5O2/c1-15-20-13-25(9-8-22(20)30-33-15)12-19-7-6-18(17-5-3-4-16(10-17)14-27)11-21(19)26(25)23(32)31(2)24(28)29-26/h3-7,10-11H,8-9,12-13H2,1-2H3,(H2,28,29)
US Patent
n/an/a 1.40n/an/an/an/a4.525
Vitae Pharmaceuticals, Inc.; Boehringer Ingelheim International GmbH
US Patent
Assay Description
Inhibitory activity of compounds was assessed by a fluorescence quench assay of BACE activity using commercially available substrate HiLyte Fluor 488...
US Patent US9212153 (2015)
BindingDB Entry DOI: 10.7270/Q2J67FRJ
Beta-secretase 1
(Homo sapiens (Human))
BDBM195378
(US10336717, Compound 462 | US9212153, 462,Ex. 396 ...)
Show SMILES CN1C(N)=NC2(C1=O)c1cc(ccc1CC21CCc2noc(C)c2C1)-c1cccc(c1)C#N |c:3|
Show InChI InChI=1S/C26H23N5O2/c1-15-20-13-25(9-8-22(20)30-33-15)12-19-7-6-18(17-5-3-4-16(10-17)14-27)11-21(19)26(25)23(32)31(2)24(28)29-26/h3-7,10-11H,8-9,12-13H2,1-2H3,(H2,28,29)
PCBioAssay
n/an/a 1.40n/an/an/an/an/an/a
SRMLSC
Curated by PubChem BioAssay
Assay Description
For each compound being tested, the BACE activity was monitored in a fluorescence quenching assay (FRET) using the ectodomain of BACE (aa 1-454) fuse...
PubChem Bioassay (2007)
BindingDB Entry DOI: 10.7270/Q2WH2NCD
Beta-secretase 1 (aa 1-458)
(Homo sapiens (Human))
BDBM195378
(US10336717, Compound 462 | US9212153, 462,Ex. 396 ...)
Show SMILES CN1C(N)=NC2(C1=O)c1cc(ccc1CC21CCc2noc(C)c2C1)-c1cccc(c1)C#N |c:3|
Show InChI InChI=1S/C26H23N5O2/c1-15-20-13-25(9-8-22(20)30-33-15)12-19-7-6-18(17-5-3-4-16(10-17)14-27)11-21(19)26(25)23(32)31(2)24(28)29-26/h3-7,10-11H,8-9,12-13H2,1-2H3,(H2,28,29)
US Patent
n/an/a 1.20n/an/an/an/a4.525
Vitae Pharmaceuticals, Inc.; Boehringer Ingelheim International GmbH
US Patent
Assay Description
Inhibitory activity of compounds was assessed by a fluorescence quench assay of BACE activity using commercially available substrate HiLyte Fluor 488...
US Patent US9212153 (2015)
BindingDB Entry DOI: 10.7270/Q2J67FRJ