BDBM195519 US10336717, Compound 246::US9212153, 245,Ex. 199
SMILES: COC1CCC2(Cc3ccc(OCC4CC4)cc3[C@]22N=C(N)N(C)C2=O)CC1
InChI Key: InChIKey=XZUCFAOSPGFWFO-UVOAEELBSA-N
Data: 2 IC50
Activity Spreadsheet -- Enzyme Inhibition Constant Data from BindingDB
Found 2 hits for monomerid = 195519
Trg + Lig
Ki
nM
ΔG°
kcal/mole
IC50
nM
Kd
nM
EC50/IC50
nM
koff
s-1
kon
M-1s-1
pHTemp
°C
Beta-secretase 1
(Homo sapiens (Human))
BDBM195519
(US10336717, Compound 246 | US9212153, 245,Ex. 199)
Show SMILES COC1CCC2(Cc3ccc(OCC4CC4)cc3[C@]22N=C(N)N(C)C2=O)CC1 |r,wD:18.21,t:22,(5.61,-4.4,;4.12,-4.8,;3.03,-3.71,;1.69,-4.48,;.62,-3.37,;-.88,-2.99,;-1.78,-4.24,;-3.25,-3.76,;-4.58,-4.53,;-5.92,-3.76,;-5.92,-2.22,;-7.25,-1.45,;-8.58,-2.22,;-9.92,-1.45,;-10.69,-.12,;-11.46,-1.45,;-4.58,-1.45,;-3.25,-2.22,;-1.78,-1.75,;-2.69,-.5,;-1.78,.74,;-2.18,2.23,;-.32,.27,;1.02,1.04,;-.32,-1.27,;1.02,-2.04,;.46,-2.22,;1.53,-3.33,)|
Show InChI InChI=1S/C22H29N3O3/c1-25-19(26)22(24-20(25)23)18-11-17(28-13-14-3-4-14)6-5-15(18)12-21(22)9-7-16(27-2)8-10-21/h5-6,11,14,16H,3-4,7-10,12-13H2,1-2H3,(H2,23,24)/t16?,21?,22-/m1/s1
PCBioAssay
n/an/a 423n/an/an/an/an/an/a
SRMLSC
Curated by PubChem BioAssay
Assay Description
For each compound being tested, the BACE activity was monitored in a fluorescence quenching assay (FRET) using the ectodomain of BACE (aa 1-454) fuse...
PubChem Bioassay (2007)
BindingDB Entry DOI: 10.7270/Q2WH2NCD
Beta-secretase 1 (aa 1-458)
(Homo sapiens (Human))
BDBM195519
(US10336717, Compound 246 | US9212153, 245,Ex. 199)
Show SMILES COC1CCC2(Cc3ccc(OCC4CC4)cc3[C@]22N=C(N)N(C)C2=O)CC1 |r,wD:18.21,t:22,(5.61,-4.4,;4.12,-4.8,;3.03,-3.71,;1.69,-4.48,;.62,-3.37,;-.88,-2.99,;-1.78,-4.24,;-3.25,-3.76,;-4.58,-4.53,;-5.92,-3.76,;-5.92,-2.22,;-7.25,-1.45,;-8.58,-2.22,;-9.92,-1.45,;-10.69,-.12,;-11.46,-1.45,;-4.58,-1.45,;-3.25,-2.22,;-1.78,-1.75,;-2.69,-.5,;-1.78,.74,;-2.18,2.23,;-.32,.27,;1.02,1.04,;-.32,-1.27,;1.02,-2.04,;.46,-2.22,;1.53,-3.33,)|
Show InChI InChI=1S/C22H29N3O3/c1-25-19(26)22(24-20(25)23)18-11-17(28-13-14-3-4-14)6-5-15(18)12-21(22)9-7-16(27-2)8-10-21/h5-6,11,14,16H,3-4,7-10,12-13H2,1-2H3,(H2,23,24)/t16?,21?,22-/m1/s1
US Patent
n/an/a 2.10n/an/an/an/a4.4n/a
Vitae Pharmaceuticals, Inc.; Boehringer Ingelheim International GmbH
US Patent
Assay Description
For each compound being tested, the BACE activity was monitored in a fluorescence quenching assay (FRET) using the ectodomain of BACE (aa 1-454) fuse...
US Patent US9212153 (2015)
BindingDB Entry DOI: 10.7270/Q2J67FRJ