null
SMILES: CCOc1ccc(cc1)C(=O)N1CCc2nc(NC(C)c3ccc(cc3)C(F)(F)F)n(OC)c(=O)c2C1
InChI Key: InChIKey=WZVABFGIISCZFI-UHFFFAOYSA-N
Activity Spreadsheet -- Enzyme Inhibition Constant Data from BindingDB
Found 2 hits for monomerid = 195689
Trg + Lig
Ki
nM
ΔG°
kcal/mole
IC50
nM
Kd
nM
EC50/IC50
nM
koff
s-1
kon
M-1s-1
pHTemp
°C
Prolactin-releasing peptide receptor
(Homo sapiens (Human))
BDBM195689
(US9206173, 2451)
Show SMILES CCOc1ccc(cc1)C(=O)N1CCc2nc(NC(C)c3ccc(cc3)C(F)(F)F)n(OC)c(=O)c2C1
Show InChI InChI=1S/C26H27F3N4O4/c1-4-37-20-11-7-18(8-12-20)23(34)32-14-13-22-21(15-32)24(35)33(36-3)25(31-22)30-16(2)17-5-9-19(10-6-17)26(27,28)29/h5-12,16H,4,13-15H2,1-3H3,(H,30,31)
US Patent
9 -11.0n/an/an/an/an/a7.425
OTSUKA PHARMACEUTICAL CO., LTD.
US Patent
Assay Description
Receptor-expressing HEK 293 cell membrane fraction was analyzed by modifying the methods of C. J. Langmead et al. (see Langmead C J, Szekeres P G; Ch...
US Patent US9206173 (2015)
BindingDB Entry DOI: 10.7270/Q23X85FS
Prolactin-releasing peptide receptor
(Homo sapiens (Human))
BDBM195689
(US9206173, 2451)
Show SMILES CCOc1ccc(cc1)C(=O)N1CCc2nc(NC(C)c3ccc(cc3)C(F)(F)F)n(OC)c(=O)c2C1
Show InChI InChI=1S/C26H27F3N4O4/c1-4-37-20-11-7-18(8-12-20)23(34)32-14-13-22-21(15-32)24(35)33(36-3)25(31-22)30-16(2)17-5-9-19(10-6-17)26(27,28)29/h5-12,16H,4,13-15H2,1-3H3,(H,30,31)
US Patent
n/an/a 1.29E+3n/an/an/an/a7.425
OTSUKA PHARMACEUTICAL CO., LTD.
US Patent
Assay Description
HEK293 cells expressing human GPR10 were maintained in Dulbecco's Modified Eagles' medium supplemented with 10% fetal bovine serum, 1% penici...
US Patent US9206173 (2015)
BindingDB Entry DOI: 10.7270/Q23X85FS