BDBM195797 US9206188, 48::US9834551, Example 48
SMILES: CN(C)\C=C\C(=O)Nc1cccc(c1)-c1cnc2[nH]nc(C)c2c1
InChI Key: InChIKey=PLPHPNTWLARELL-BQYQJAHWSA-N
Data: 6 IC50
Activity Spreadsheet -- Enzyme Inhibition Constant Data from BindingDB
Found 6 hits for monomerid = 195797
Trg + Lig
Ki
nM
ΔG°
kcal/mole
IC50
nM
Kd
nM
EC50/IC50
nM
koff
s-1
kon
M-1s-1
pHTemp
°C
Tyrosine-protein kinase ITK/TSK
(Homo sapiens (Human))
BDBM195797
(US9206188, 48 | US9834551, Example 48)
Show SMILES CN(C)\C=C\C(=O)Nc1cccc(c1)-c1cnc2[nH]nc(C)c2c1
Show InChI InChI=1S/C18H19N5O/c1-12-16-10-14(11-19-18(16)22-21-12)13-5-4-6-15(9-13)20-17(24)7-8-23(2)3/h4-11H,1-3H3,(H,20,24)(H,19,21,22)/b8-7+
Reactome pathway
US Patent
n/an/a 30n/an/an/an/an/an/a
ARRIEN PHARMACEUTICALS LLC
US Patent
Assay Description
1H-pyrrolo[2,3-b]pyridine, 1H-pyrazolo[3,4-b]pyridine and 5H-pyrrolo[2,3-b]pyrazine series of compounds exhibited over >100 fold selective against Ja...
US Patent US9206188 (2015)
BindingDB Entry DOI: 10.7270/Q2057DRT
Tyrosine-protein kinase BTK
(Homo sapiens (Human))
BDBM195797
(US9206188, 48 | US9834551, Example 48)
Show SMILES CN(C)\C=C\C(=O)Nc1cccc(c1)-c1cnc2[nH]nc(C)c2c1
Show InChI InChI=1S/C18H19N5O/c1-12-16-10-14(11-19-18(16)22-21-12)13-5-4-6-15(9-13)20-17(24)7-8-23(2)3/h4-11H,1-3H3,(H,20,24)(H,19,21,22)/b8-7+
NCI pathway
Reactome pathway
US Patent
n/an/a 739n/an/an/an/an/an/a
ARRIEN PHARMACEUTICALS LLC
US Patent
Assay Description
1H-pyrrolo[2,3-b]pyridine, 1H-pyrazolo[3,4-b]pyridine and 5H-pyrrolo[2,3-b]pyrazine series of compounds exhibited over >100 fold selective against Ja...
US Patent US9206188 (2015)
BindingDB Entry DOI: 10.7270/Q2057DRT
Tyrosine-protein kinase JAK3
(Homo sapiens (Human))
BDBM195797
(US9206188, 48 | US9834551, Example 48)
Show SMILES CN(C)\C=C\C(=O)Nc1cccc(c1)-c1cnc2[nH]nc(C)c2c1
Show InChI InChI=1S/C18H19N5O/c1-12-16-10-14(11-19-18(16)22-21-12)13-5-4-6-15(9-13)20-17(24)7-8-23(2)3/h4-11H,1-3H3,(H,20,24)(H,19,21,22)/b8-7+
Reactome pathway
US Patent
n/an/a>100n/an/an/an/an/an/a
ARRIEN PHARMACEUTICALS LLC
US Patent
Assay Description
ITK and JAK3 Kinase assay procedures:Enzyme was incubated with substrate peptide in reaction buffer in the presence and absence of test compounds or ...
US Patent US9834551 (2017)
BindingDB Entry DOI: 10.7270/Q2PZ5C4Q
Tyrosine-protein kinase JAK3
(Homo sapiens (Human))
BDBM195797
(US9206188, 48 | US9834551, Example 48)
Show SMILES CN(C)\C=C\C(=O)Nc1cccc(c1)-c1cnc2[nH]nc(C)c2c1
Show InChI InChI=1S/C18H19N5O/c1-12-16-10-14(11-19-18(16)22-21-12)13-5-4-6-15(9-13)20-17(24)7-8-23(2)3/h4-11H,1-3H3,(H,20,24)(H,19,21,22)/b8-7+
Reactome pathway
US Patent
n/an/a<5n/an/an/an/an/an/a
ARRIEN PHARMACEUTICALS LLC
US Patent
Assay Description
1H-pyrrolo[2,3-b]pyridine, 1H-pyrazolo[3,4-b]pyridine and 5H-pyrrolo[2,3-b]pyrazine series of compounds exhibited over >100 fold selective against Ja...
US Patent US9206188 (2015)
BindingDB Entry DOI: 10.7270/Q2057DRT
Tyrosine-protein kinase ITK/TSK
(Homo sapiens (Human))
BDBM195797
(US9206188, 48 | US9834551, Example 48)
Show SMILES CN(C)\C=C\C(=O)Nc1cccc(c1)-c1cnc2[nH]nc(C)c2c1
Show InChI InChI=1S/C18H19N5O/c1-12-16-10-14(11-19-18(16)22-21-12)13-5-4-6-15(9-13)20-17(24)7-8-23(2)3/h4-11H,1-3H3,(H,20,24)(H,19,21,22)/b8-7+
Reactome pathway
US Patent
n/an/a>100n/an/an/an/an/an/a
ARRIEN PHARMACEUTICALS LLC
US Patent
Assay Description
ITK and JAK3 Kinase assay procedures:Enzyme was incubated with substrate peptide in reaction buffer in the presence and absence of test compounds or ...
US Patent US9834551 (2017)
BindingDB Entry DOI: 10.7270/Q2PZ5C4Q
Tyrosine-protein kinase ITK/TSK
(Homo sapiens (Human))
BDBM195797
(US9206188, 48 | US9834551, Example 48)
Show SMILES CN(C)\C=C\C(=O)Nc1cccc(c1)-c1cnc2[nH]nc(C)c2c1
Show InChI InChI=1S/C18H19N5O/c1-12-16-10-14(11-19-18(16)22-21-12)13-5-4-6-15(9-13)20-17(24)7-8-23(2)3/h4-11H,1-3H3,(H,20,24)(H,19,21,22)/b8-7+
Reactome pathway
US Patent
n/an/a 35n/an/an/an/an/an/a
ARRIEN PHARMACEUTICALS LLC
US Patent
Assay Description
1H-pyrrolo[2,3-b]pyridine, 1H-pyrazolo[3,4-b]pyridine and 5H-pyrrolo[2,3-b]pyrazine series of compounds exhibited over >100 fold selective against Ja...
US Patent US9206188 (2015)
BindingDB Entry DOI: 10.7270/Q2057DRT