BDBM195807 US9206188, 58::US9834551, Example 58
SMILES: Clc1c[nH]c2ncc(cc12)-c1cccc(NC(=O)C=C)n1
InChI Key: InChIKey=SCGPRWAOEPYMGB-UHFFFAOYSA-N
Data: 6 IC50
Activity Spreadsheet -- Enzyme Inhibition Constant Data from BindingDB
Found 6 hits for monomerid = 195807
Trg + Lig
Ki
nM
ΔG°
kcal/mole
IC50
nM
Kd
nM
EC50/IC50
nM
koff
s-1
kon
M-1s-1
pHTemp
°C
Tyrosine-protein kinase ITK/TSK
(Homo sapiens (Human))
BDBM195807
(US9206188, 58 | US9834551, Example 58)
Show SMILES Clc1c[nH]c2ncc(cc12)-c1cccc(NC(=O)C=C)n1
Show InChI InChI=1S/C15H11ClN4O/c1-2-14(21)20-13-5-3-4-12(19-13)9-6-10-11(16)8-18-15(10)17-7-9/h2-8H,1H2,(H,17,18)(H,19,20,21)
Reactome pathway
US Patent
n/an/a 30n/an/an/an/an/an/a
ARRIEN PHARMACEUTICALS LLC
US Patent
Assay Description
1H-pyrrolo[2,3-b]pyridine, 1H-pyrazolo[3,4-b]pyridine and 5H-pyrrolo[2,3-b]pyrazine series of compounds exhibited over >100 fold selective against Ja...
US Patent US9206188 (2015)
BindingDB Entry DOI: 10.7270/Q2057DRT
Tyrosine-protein kinase BTK
(Homo sapiens (Human))
BDBM195807
(US9206188, 58 | US9834551, Example 58)
Show SMILES Clc1c[nH]c2ncc(cc12)-c1cccc(NC(=O)C=C)n1
Show InChI InChI=1S/C15H11ClN4O/c1-2-14(21)20-13-5-3-4-12(19-13)9-6-10-11(16)8-18-15(10)17-7-9/h2-8H,1H2,(H,17,18)(H,19,20,21)
NCI pathway
Reactome pathway
US Patent
n/an/a 739n/an/an/an/an/an/a
ARRIEN PHARMACEUTICALS LLC
US Patent
Assay Description
1H-pyrrolo[2,3-b]pyridine, 1H-pyrazolo[3,4-b]pyridine and 5H-pyrrolo[2,3-b]pyrazine series of compounds exhibited over >100 fold selective against Ja...
US Patent US9206188 (2015)
BindingDB Entry DOI: 10.7270/Q2057DRT
Tyrosine-protein kinase JAK3
(Homo sapiens (Human))
BDBM195807
(US9206188, 58 | US9834551, Example 58)
Show SMILES Clc1c[nH]c2ncc(cc12)-c1cccc(NC(=O)C=C)n1
Show InChI InChI=1S/C15H11ClN4O/c1-2-14(21)20-13-5-3-4-12(19-13)9-6-10-11(16)8-18-15(10)17-7-9/h2-8H,1H2,(H,17,18)(H,19,20,21)
Reactome pathway
US Patent
n/an/a<100n/an/an/an/an/an/a
ARRIEN PHARMACEUTICALS LLC
US Patent
Assay Description
ITK and JAK3 Kinase assay procedures:Enzyme was incubated with substrate peptide in reaction buffer in the presence and absence of test compounds or ...
US Patent US9834551 (2017)
BindingDB Entry DOI: 10.7270/Q2PZ5C4Q
Tyrosine-protein kinase JAK3
(Homo sapiens (Human))
BDBM195807
(US9206188, 58 | US9834551, Example 58)
Show SMILES Clc1c[nH]c2ncc(cc12)-c1cccc(NC(=O)C=C)n1
Show InChI InChI=1S/C15H11ClN4O/c1-2-14(21)20-13-5-3-4-12(19-13)9-6-10-11(16)8-18-15(10)17-7-9/h2-8H,1H2,(H,17,18)(H,19,20,21)
Reactome pathway
US Patent
n/an/a<5n/an/an/an/an/an/a
ARRIEN PHARMACEUTICALS LLC
US Patent
Assay Description
1H-pyrrolo[2,3-b]pyridine, 1H-pyrazolo[3,4-b]pyridine and 5H-pyrrolo[2,3-b]pyrazine series of compounds exhibited over >100 fold selective against Ja...
US Patent US9206188 (2015)
BindingDB Entry DOI: 10.7270/Q2057DRT
Tyrosine-protein kinase ITK/TSK
(Homo sapiens (Human))
BDBM195807
(US9206188, 58 | US9834551, Example 58)
Show SMILES Clc1c[nH]c2ncc(cc12)-c1cccc(NC(=O)C=C)n1
Show InChI InChI=1S/C15H11ClN4O/c1-2-14(21)20-13-5-3-4-12(19-13)9-6-10-11(16)8-18-15(10)17-7-9/h2-8H,1H2,(H,17,18)(H,19,20,21)
Reactome pathway
US Patent
n/an/a>100n/an/an/an/an/an/a
ARRIEN PHARMACEUTICALS LLC
US Patent
Assay Description
ITK and JAK3 Kinase assay procedures:Enzyme was incubated with substrate peptide in reaction buffer in the presence and absence of test compounds or ...
US Patent US9834551 (2017)
BindingDB Entry DOI: 10.7270/Q2PZ5C4Q
Tyrosine-protein kinase ITK/TSK
(Homo sapiens (Human))
BDBM195807
(US9206188, 58 | US9834551, Example 58)
Show SMILES Clc1c[nH]c2ncc(cc12)-c1cccc(NC(=O)C=C)n1
Show InChI InChI=1S/C15H11ClN4O/c1-2-14(21)20-13-5-3-4-12(19-13)9-6-10-11(16)8-18-15(10)17-7-9/h2-8H,1H2,(H,17,18)(H,19,20,21)
Reactome pathway
US Patent
n/an/a 35n/an/an/an/an/an/a
ARRIEN PHARMACEUTICALS LLC
US Patent
Assay Description
1H-pyrrolo[2,3-b]pyridine, 1H-pyrazolo[3,4-b]pyridine and 5H-pyrrolo[2,3-b]pyrazine series of compounds exhibited over >100 fold selective against Ja...
US Patent US9206188 (2015)
BindingDB Entry DOI: 10.7270/Q2057DRT