BDBM19587 (2S)-4-methyl-2-[(3-methylphenyl)formamido]-N-(2-{[4-(trifluoromethoxy)phenyl]amino}ethyl)pentanamide::arylaminoethyl amide, 3c
SMILES: CC(C)C[C@H](NC(=O)c1cccc(C)c1)C(=O)NCCNc1ccc(OC(F)(F)F)cc1
InChI Key: InChIKey=NOGPDFYAILRYLC-FQEVSTJZSA-N
Data: 3 KI
Activity Spreadsheet -- Enzyme Inhibition Constant Data from BindingDB
Found 3 hits for monomerid = 19587
Trg + Lig
Ki
nM
ΔG°
kcal/mole
IC50
nM
Kd
nM
EC50/IC50
nM
koff
s-1
kon
M-1s-1
pHTemp
°C
Cathepsin S
(Homo sapiens (Human))
BDBM19587
((2S)-4-methyl-2-[(3-methylphenyl)formamido]-N-(2-{...)
Show SMILES CC(C)C[C@H](NC(=O)c1cccc(C)c1)C(=O)NCCNc1ccc(OC(F)(F)F)cc1 |r|
Show InChI InChI=1S/C23H28F3N3O3/c1-15(2)13-20(29-21(30)17-6-4-5-16(3)14-17)22(31)28-12-11-27-18-7-9-19(10-8-18)32-23(24,25)26/h4-10,14-15,20,27H,11-13H2,1-3H3,(H,28,31)(H,29,30)/t20-/m0/s1
Reactome pathway
104 -9.90n/an/an/an/an/a5.537
GNF
Assay Description
The recombinant human cathepsin enzyme was preincubated with inhibitor for 20 minutes prior to addition of substrate. The substrate hydrolysis was mo...
Bioorg Med Chem Lett 16: 1486-90 (2006)
Article DOI: 10.1016/j.bmcl.2005.12.056
BindingDB Entry DOI: 10.7270/Q2TQ5ZTJ
Procathepsin L
(Homo sapiens (Human))
BDBM19587
((2S)-4-methyl-2-[(3-methylphenyl)formamido]-N-(2-{...)
Show SMILES CC(C)C[C@H](NC(=O)c1cccc(C)c1)C(=O)NCCNc1ccc(OC(F)(F)F)cc1 |r|
Show InChI InChI=1S/C23H28F3N3O3/c1-15(2)13-20(29-21(30)17-6-4-5-16(3)14-17)22(31)28-12-11-27-18-7-9-19(10-8-18)32-23(24,25)26/h4-10,14-15,20,27H,11-13H2,1-3H3,(H,28,31)(H,29,30)/t20-/m0/s1
Reactome pathway
120n/an/an/an/an/an/an/an/a
GNF
Assay Description
The recombinant human cathepsin enzyme was preincubated with inhibitor for 20 minutes prior to addition of substrate. The substrate hydrolysis was mo...
Bioorg Med Chem Lett 16: 1486-90 (2006)
Article DOI: 10.1016/j.bmcl.2005.12.056
BindingDB Entry DOI: 10.7270/Q2TQ5ZTJ
Cathepsin K
(Homo sapiens (Human))
BDBM19587
((2S)-4-methyl-2-[(3-methylphenyl)formamido]-N-(2-{...)
Show SMILES CC(C)C[C@H](NC(=O)c1cccc(C)c1)C(=O)NCCNc1ccc(OC(F)(F)F)cc1 |r|
Show InChI InChI=1S/C23H28F3N3O3/c1-15(2)13-20(29-21(30)17-6-4-5-16(3)14-17)22(31)28-12-11-27-18-7-9-19(10-8-18)32-23(24,25)26/h4-10,14-15,20,27H,11-13H2,1-3H3,(H,28,31)(H,29,30)/t20-/m0/s1
Reactome pathway
125n/an/an/an/an/an/an/an/a
GNF
Assay Description
The recombinant human cathepsin enzyme was preincubated with inhibitor for 20 minutes prior to addition of substrate. The substrate hydrolysis was mo...
Bioorg Med Chem Lett 16: 1486-90 (2006)
Article DOI: 10.1016/j.bmcl.2005.12.056
BindingDB Entry DOI: 10.7270/Q2TQ5ZTJ