BDBM19595 (2S)-4-cyclohexyl-N-[(2S)-1-(5-fluoro-2,3-dihydro-1H-indol-1-yl)-4-methylpentan-2-yl]-2-[(3-methoxyphenyl)formamido]butanamide::arylaminoethyl amide, 8c
SMILES: COc1cccc(c1)C(=O)N[C@@H](CCC1CCCCC1)C(=O)N[C@@H](CC(C)C)CN1CCc2cc(F)ccc12
InChI Key: InChIKey=GSQKCXDZNXYUKT-YTMVLYRLSA-N
Data: 3 KI
Activity Spreadsheet -- Enzyme Inhibition Constant Data from BindingDB
Found 3 hits for monomerid = 19595
Trg + Lig
Ki
nM
ΔG°
kcal/mole
IC50
nM
Kd
nM
EC50/IC50
nM
koff
s-1
kon
M-1s-1
pHTemp
°C
Cathepsin S
(Homo sapiens (Human))
BDBM19595
((2S)-4-cyclohexyl-N-[(2S)-1-(5-fluoro-2,3-dihydro-...)
Show SMILES COc1cccc(c1)C(=O)N[C@@H](CCC1CCCCC1)C(=O)N[C@@H](CC(C)C)CN1CCc2cc(F)ccc12 |r|
Show InChI InChI=1S/C32H44FN3O3/c1-22(2)18-27(21-36-17-16-24-19-26(33)13-15-30(24)36)34-32(38)29(14-12-23-8-5-4-6-9-23)35-31(37)25-10-7-11-28(20-25)39-3/h7,10-11,13,15,19-20,22-23,27,29H,4-6,8-9,12,14,16-18,21H2,1-3H3,(H,34,38)(H,35,37)/t27-,29-/m0/s1
Reactome pathway
28 -10.7n/an/an/an/an/a5.537
GNF
Assay Description
The recombinant human cathepsin enzyme was preincubated with inhibitor for 20 minutes prior to addition of substrate. The substrate hydrolysis was mo...
Bioorg Med Chem Lett 16: 1486-90 (2006)
Article DOI: 10.1016/j.bmcl.2005.12.056
BindingDB Entry DOI: 10.7270/Q2TQ5ZTJ
Procathepsin L
(Homo sapiens (Human))
BDBM19595
((2S)-4-cyclohexyl-N-[(2S)-1-(5-fluoro-2,3-dihydro-...)
Show SMILES COc1cccc(c1)C(=O)N[C@@H](CCC1CCCCC1)C(=O)N[C@@H](CC(C)C)CN1CCc2cc(F)ccc12 |r|
Show InChI InChI=1S/C32H44FN3O3/c1-22(2)18-27(21-36-17-16-24-19-26(33)13-15-30(24)36)34-32(38)29(14-12-23-8-5-4-6-9-23)35-31(37)25-10-7-11-28(20-25)39-3/h7,10-11,13,15,19-20,22-23,27,29H,4-6,8-9,12,14,16-18,21H2,1-3H3,(H,34,38)(H,35,37)/t27-,29-/m0/s1
Reactome pathway
1.80E+3n/an/an/an/an/an/an/an/a
GNF
Assay Description
The recombinant human cathepsin enzyme was preincubated with inhibitor for 20 minutes prior to addition of substrate. The substrate hydrolysis was mo...
Bioorg Med Chem Lett 16: 1486-90 (2006)
Article DOI: 10.1016/j.bmcl.2005.12.056
BindingDB Entry DOI: 10.7270/Q2TQ5ZTJ
Cathepsin K
(Homo sapiens (Human))
BDBM19595
((2S)-4-cyclohexyl-N-[(2S)-1-(5-fluoro-2,3-dihydro-...)
Show SMILES COc1cccc(c1)C(=O)N[C@@H](CCC1CCCCC1)C(=O)N[C@@H](CC(C)C)CN1CCc2cc(F)ccc12 |r|
Show InChI InChI=1S/C32H44FN3O3/c1-22(2)18-27(21-36-17-16-24-19-26(33)13-15-30(24)36)34-32(38)29(14-12-23-8-5-4-6-9-23)35-31(37)25-10-7-11-28(20-25)39-3/h7,10-11,13,15,19-20,22-23,27,29H,4-6,8-9,12,14,16-18,21H2,1-3H3,(H,34,38)(H,35,37)/t27-,29-/m0/s1
Reactome pathway
>1.00E+5n/an/an/an/an/an/an/an/a
GNF
Assay Description
The recombinant human cathepsin enzyme was preincubated with inhibitor for 20 minutes prior to addition of substrate. The substrate hydrolysis was mo...
Bioorg Med Chem Lett 16: 1486-90 (2006)
Article DOI: 10.1016/j.bmcl.2005.12.056
BindingDB Entry DOI: 10.7270/Q2TQ5ZTJ