null
SMILES: CC1(C)CCCC2(C)C1CCc1oc3c(B(O)O)c(O)c(O)cc3c21
InChI Key: InChIKey=FKFXIIKVWQCPFN-UHFFFAOYSA-N
Activity Spreadsheet -- Enzyme Inhibition Constant Data from BindingDB
Found 4 hits for monomerid = 196114
Trg + Lig
Ki
nM
ΔG°
kcal/mole
IC50
nM
Kd
nM
EC50/IC50
nM
koff
s-1
kon
M-1s-1
pHTemp
°C
Phosphatidylinositol 4,5-bisphosphate 3-kinase catalytic subunit alpha isoform
(Homo sapiens (Human))
BDBM196114
(US9206201, AZ)
Show SMILES CC1(C)CCCC2(C)C1CCc1oc3c(B(O)O)c(O)c(O)cc3c21
Show InChI InChI=1S/C19H25BO5/c1-18(2)7-4-8-19(3)13(18)6-5-12-14(19)10-9-11(21)16(22)15(20(23)24)17(10)25-12/h9,13,21-24H,4-8H2,1-3H3
NCI pathway
Reactome pathway
US Patent
n/an/a 23n/an/an/an/an/an/a
Counsel of Scientific & Industrial Research
US Patent
Assay Description
PI3K inhibition assay (PI3K Assay (Emmanuelle M, Huang Y, Yan H G et al. Targeting Protein Translation in Human Non-Small Cell Lung Cancer via Combin...
US Patent US9206201 (2015)
BindingDB Entry DOI: 10.7270/Q2QR4VZ4
Phosphatidylinositol 4,5-bisphosphate 3-kinase catalytic subunit delta isoform
(Homo sapiens (Human))
BDBM196114
(US9206201, AZ)
Show SMILES CC1(C)CCCC2(C)C1CCc1oc3c(B(O)O)c(O)c(O)cc3c21
Show InChI InChI=1S/C19H25BO5/c1-18(2)7-4-8-19(3)13(18)6-5-12-14(19)10-9-11(21)16(22)15(20(23)24)17(10)25-12/h9,13,21-24H,4-8H2,1-3H3
NCI pathway
Reactome pathway
US Patent
n/an/a 3.03E+5n/an/an/an/an/an/a
Counsel of Scientific & Industrial Research
US Patent
Assay Description
PI3K inhibition assay (PI3K Assay (Emmanuelle M, Huang Y, Yan H G et al. Targeting Protein Translation in Human Non-Small Cell Lung Cancer via Combin...
US Patent US9206201 (2015)
BindingDB Entry DOI: 10.7270/Q2QR4VZ4
Phosphatidylinositol 4,5-bisphosphate 3-kinase catalytic subunit gamma isoform
(Homo sapiens (Human))
BDBM196114
(US9206201, AZ)
Show SMILES CC1(C)CCCC2(C)C1CCc1oc3c(B(O)O)c(O)c(O)cc3c21
Show InChI InChI=1S/C19H25BO5/c1-18(2)7-4-8-19(3)13(18)6-5-12-14(19)10-9-11(21)16(22)15(20(23)24)17(10)25-12/h9,13,21-24H,4-8H2,1-3H3
NCI pathway
Reactome pathway
US Patent
n/an/a 8.54E+4n/an/an/an/an/an/a
Counsel of Scientific & Industrial Research
US Patent
Assay Description
PI3K inhibition assay (PI3K Assay (Emmanuelle M, Huang Y, Yan H G et al. Targeting Protein Translation in Human Non-Small Cell Lung Cancer via Combin...
US Patent US9206201 (2015)
BindingDB Entry DOI: 10.7270/Q2QR4VZ4
Phosphatidylinositol 4,5-bisphosphate 3-kinase catalytic subunit beta isoform
(Homo sapiens (Human))
BDBM196114
(US9206201, AZ)
Show SMILES CC1(C)CCCC2(C)C1CCc1oc3c(B(O)O)c(O)c(O)cc3c21
Show InChI InChI=1S/C19H25BO5/c1-18(2)7-4-8-19(3)13(18)6-5-12-14(19)10-9-11(21)16(22)15(20(23)24)17(10)25-12/h9,13,21-24H,4-8H2,1-3H3
NCI pathway
Reactome pathway
US Patent
n/an/a 5.70E+3n/an/an/an/an/an/a
Counsel of Scientific & Industrial Research
US Patent
Assay Description
PI3K inhibition assay (PI3K Assay (Emmanuelle M, Huang Y, Yan H G et al. Targeting Protein Translation in Human Non-Small Cell Lung Cancer via Combin...
US Patent US9206201 (2015)
BindingDB Entry DOI: 10.7270/Q2QR4VZ4