BDBM196160 US9211296, Table 6, 14
SMILES: N=C1N2N=CSC2=NC(=O)\C1=C/c1coc2ccccc2c1=O
InChI Key: InChIKey=FJAJNDQHDCPAKD-YRYWFDQNSA-N
Data: 1 IC50
Activity Spreadsheet -- Enzyme Inhibition Constant Data from BindingDB
Found 1 hit for monomerid = 196160
Trg + Lig
Ki
nM
ΔG°
kcal/mole
IC50
nM
Kd
nM
EC50/IC50
nM
koff
s-1
kon
M-1s-1
pHTemp
°C
DNA Synthesis
(Vaccinia virus (strain WR))
BDBM196160
(US9211296, Table 6, 14)
Show SMILES N=C1N2N=CSC2=NC(=O)\C1=C/c1coc2ccccc2c1=O |c:3,7|
Show InChI InChI=1S/C15H8N4O3S/c16-13-10(14(21)18-15-19(13)17-7-23-15)5-8-6-22-11-4-2-1-3-9(11)12(8)20/h1-7,16H/b10-5-,16-13?
US Patent
n/an/a 7.50E+4n/an/an/an/a7.437
The Trustees of the University of Pennsylvania
US Patent
Assay Description
A rapid plate DNA synthesis assay was performed using optimized conditions. Briefly, a 1.2:1 ratio of a 20-mer oligonucleotide primer (5′-GCGAA...
US Patent US9211296 (2015)
BindingDB Entry DOI: 10.7270/Q2G73CHS