null
SMILES: CC(=O)n1c2ccccc2c2nc(C)sc12
InChI Key: InChIKey=KEEYWBAIEIYLBN-UHFFFAOYSA-N
Activity Spreadsheet -- Enzyme Inhibition Constant Data from BindingDB
Found 1 hit for monomerid = 196161
Trg + Lig
Ki
nM
ΔG°
kcal/mole
IC50
nM
Kd
nM
EC50/IC50
nM
koff
s-1
kon
M-1s-1
pHTemp
°C
DNA polymerase
(Vaccinia virus (strain WR))
BDBM196161
(US9211296, Table 6, 15)
Show SMILES CC(=O)n1c2ccccc2c2nc(C)sc12
Show InChI InChI=1S/C12H10N2OS/c1-7-13-11-9-5-3-4-6-10(9)14(8(2)15)12(11)16-7/h3-6H,1-2H3
US Patent
n/an/a 1.11E+5n/an/an/an/a7.437
The Trustees of the University of Pennsylvania
US Patent
Assay Description
A rapid plate DNA synthesis assay was performed using optimized conditions. Briefly, a 1.2:1 ratio of a 20-mer oligonucleotide primer (5′-GCGAA...
US Patent US9211296 (2015)
BindingDB Entry DOI: 10.7270/Q2G73CHS