BDBM196657 US9212147, 14
SMILES: OCc1ccc(CCc2cc(O)c(=O)[nH]n2)cc1
InChI Key: InChIKey=XHFJXILOSNMVBV-UHFFFAOYSA-N
Data: 2 IC50
Activity Spreadsheet -- Enzyme Inhibition Constant Data from BindingDB
Found 2 hits for monomerid = 196657
Trg + Lig
Ki
nM
ΔG°
kcal/mole
IC50
nM
Kd
nM
EC50/IC50
nM
koff
s-1
kon
M-1s-1
pHTemp
°C
D-amino-acid oxidase
(Homo sapiens (Human))
BDBM196657
(US9212147, 14)
Show SMILES OCc1ccc(CCc2cc(O)c(=O)[nH]n2)cc1
Show InChI InChI=1S/C13H14N2O3/c16-8-10-3-1-9(2-4-10)5-6-11-7-12(17)13(18)15-14-11/h1-4,7,16H,5-6,8H2,(H,14,17)(H,15,18)
Reactome pathway
US Patent
n/an/a 10n/an/an/an/a7.525
Takeda Pharmaceutical Company Limited
US Patent
Assay Description
This test was performed by partially modifying the method of Philip et. al. (J. Biomol. Screen. Vol. 11, pp 481-487, 2006). HEK293 cells that stably ...
US Patent US9212147 (2015)
BindingDB Entry DOI: 10.7270/Q29G5KKS
D-amino-acid oxidase
(Homo sapiens (Human))
BDBM196657
(US9212147, 14)
Show SMILES OCc1ccc(CCc2cc(O)c(=O)[nH]n2)cc1
Show InChI InChI=1S/C13H14N2O3/c16-8-10-3-1-9(2-4-10)5-6-11-7-12(17)13(18)15-14-11/h1-4,7,16H,5-6,8H2,(H,14,17)(H,15,18)
Reactome pathway
US Patent
n/an/a 2.90n/an/an/an/a7.525
Takeda Pharmaceutical Company Limited
US Patent
Assay Description
The DAAO inhibitory activity was measured by assaying the amount of hydrogen peroxide (H2O2) produced by reacting DAAO protein with flavin adenine di...
US Patent US9212147 (2015)
BindingDB Entry DOI: 10.7270/Q29G5KKS