BDBM196674 US10202399, Example 232::US9212147, 232
SMILES: Oc1n[nH]c(COc2cccc(F)c2)cc1=O
InChI Key: InChIKey=CQHIXZQMGXKOGC-UHFFFAOYSA-N
Data: 3 IC50
Activity Spreadsheet -- Enzyme Inhibition Constant Data from BindingDB
Found 3 hits for monomerid = 196674
Trg + Lig
Ki
nM
ΔG°
kcal/mole
IC50
nM
Kd
nM
EC50/IC50
nM
koff
s-1
kon
M-1s-1
pHTemp
°C
D-amino-acid oxidase
(Homo sapiens (Human))
BDBM196674
(US10202399, Example 232 | US9212147, 232)
Show SMILES Oc1n[nH]c(COc2cccc(F)c2)cc1=O
Show InChI InChI=1S/C11H9FN2O3/c12-7-2-1-3-9(4-7)17-6-8-5-10(15)11(16)14-13-8/h1-5H,6H2,(H,13,15)(H,14,16)
Reactome pathway
US Patent
n/an/a 2.30n/an/an/an/a7.525
Takeda Pharmaceutical Company Limited
US Patent
Assay Description
The DAAO inhibitory activity was measured by assaying the amount of hydrogen peroxide (H2O2) produced by reacting DAAO protein with flavin adenine di...
US Patent US9212147 (2015)
BindingDB Entry DOI: 10.7270/Q29G5KKS
D-amino-acid oxidase
(Homo sapiens (Human))
BDBM196674
(US10202399, Example 232 | US9212147, 232)
Show SMILES Oc1n[nH]c(COc2cccc(F)c2)cc1=O
Show InChI InChI=1S/C11H9FN2O3/c12-7-2-1-3-9(4-7)17-6-8-5-10(15)11(16)14-13-8/h1-5H,6H2,(H,13,15)(H,14,16)
Reactome pathway
US Patent
n/an/a 2.30n/an/an/an/an/an/a
Takeda Pharmaceutical Company Limited
US Patent
Assay Description
The DAAO inhibitory activity was measured by assaying the amount of hydrogen peroxide (H2O2) produced by reacting DAAO protein with flavin adenine di...
US Patent US10202399 (2019)
BindingDB Entry DOI: 10.7270/Q2542QQD
D-amino-acid oxidase
(Homo sapiens (Human))
BDBM196674
(US10202399, Example 232 | US9212147, 232)
Show SMILES Oc1n[nH]c(COc2cccc(F)c2)cc1=O
Show InChI InChI=1S/C11H9FN2O3/c12-7-2-1-3-9(4-7)17-6-8-5-10(15)11(16)14-13-8/h1-5H,6H2,(H,13,15)(H,14,16)
Reactome pathway
US Patent
n/an/a 13n/an/an/an/a7.525
Takeda Pharmaceutical Company Limited
US Patent
Assay Description
This test was performed by partially modifying the method of Philip et. al. (J. Biomol. Screen. Vol. 11, pp 481-487, 2006). HEK293 cells that stably ...
US Patent US9212147 (2015)
BindingDB Entry DOI: 10.7270/Q29G5KKS