BDBM196698 US9212171, 23
SMILES: CN1CCCCC(c2ccc(cn2)C#Cc2ccc(F)cc2)C1=O
InChI Key: InChIKey=JRTOXUHDTQKLSX-UHFFFAOYSA-N
Data: 1 EC50
Activity Spreadsheet -- Enzyme Inhibition Constant Data from BindingDB
Found 1 hit for monomerid = 196698
Trg + Lig
Ki
nM
ΔG°
kcal/mole
IC50
nM
Kd
nM
EC50/IC50
nM
koff
s-1
kon
M-1s-1
pHTemp
°C
Metabotropic glutamate receptor 5a (mGluR5)
(Homo sapiens (Human))
BDBM196698
(US9212171, 23)
Show SMILES CN1CCCCC(c2ccc(cn2)C#Cc2ccc(F)cc2)C1=O
Show InChI InChI=1S/C20H19FN2O/c1-23-13-3-2-4-18(20(23)24)19-12-9-16(14-22-19)6-5-15-7-10-17(21)11-8-15/h7-12,14,18H,2-4,13H2,1H3
US Patent
n/an/an/an/a 90n/an/an/a37
HOFFMANN-LA ROCHE INC.
US Patent
Assay Description
A monoclonal HEK-293 cell line stably transfected with a cDNA encoding for the human mGlu5a receptor was generated; for the work with mGlu5 Positive ...
US Patent US9212171 (2015)
BindingDB Entry DOI: 10.7270/Q25Q4TWH