BDBM196756 US10590114, No. 18::US9212173, 34::US9932325, Example 18
SMILES: CCNc1nc(Nc2cn(nc2C)C(C)(C)c2ccn(C)n2)ncc1C(F)(F)F
InChI Key: InChIKey=ISZJAZJOOJYYPL-UHFFFAOYSA-N
Data: 1 KI  2 IC50
Activity Spreadsheet -- Enzyme Inhibition Constant Data from BindingDB
Found 3 hits for monomerid = 196756
Trg + Lig
Ki
nM
ΔG°
kcal/mole
IC50
nM
Kd
nM
EC50/IC50
nM
koff
s-1
kon
M-1s-1
pHTemp
°C
Leucine-rich repeat serine/threonine-protein kinase 2 (LRRK2)
(Homo sapiens (Human))
BDBM196756
(US10590114, No. 18 | US9212173, 34 | US9932325, Ex...)
Show SMILES CCNc1nc(Nc2cn(nc2C)C(C)(C)c2ccn(C)n2)ncc1C(F)(F)F
Show InChI InChI=1S/C18H23F3N8/c1-6-22-15-12(18(19,20)21)9-23-16(25-15)24-13-10-29(26-11(13)2)17(3,4)14-7-8-28(5)27-14/h7-10H,6H2,1-5H3,(H2,22,23,24,25)
US Patent
21.7n/an/an/an/an/an/an/an/a
Genentech, Inc.
US Patent
Assay Description
This assay was used to determine a compound's potency in inhibiting activity of LRRK2 by determining, Kiapp, IC50, or percent inhibition values. In 3...
US Patent US9212173 (2015)
BindingDB Entry DOI: 10.7270/Q2222SKT
Leucine-rich repeat serine/threonine-protein kinase 2
(Homo sapiens (Human))
BDBM196756
(US10590114, No. 18 | US9212173, 34 | US9932325, Ex...)
Show SMILES CCNc1nc(Nc2cn(nc2C)C(C)(C)c2ccn(C)n2)ncc1C(F)(F)F
Show InChI InChI=1S/C18H23F3N8/c1-6-22-15-12(18(19,20)21)9-23-16(25-15)24-13-10-29(26-11(13)2)17(3,4)14-7-8-28(5)27-14/h7-10H,6H2,1-5H3,(H2,22,23,24,25)
US Patent
n/an/a<30n/an/an/an/an/an/a
Denali Therapautics Inc.
US Patent
Assay Description
Materials: LRRK2 G2019S enzyme Substrate (LRRKtide) ATP TR-FRET dilution buffer pLRRKtide antibody 384-well...
US Patent US10590114 (2020)
Leucine-rich repeat serine/threonine-protein kinase 2 G2019S
(Homo sapiens (Human))
BDBM196756
(US10590114, No. 18 | US9212173, 34 | US9932325, Ex...)
Show SMILES CCNc1nc(Nc2cn(nc2C)C(C)(C)c2ccn(C)n2)ncc1C(F)(F)F
Show InChI InChI=1S/C18H23F3N8/c1-6-22-15-12(18(19,20)21)9-23-16(25-15)24-13-10-29(26-11(13)2)17(3,4)14-7-8-28(5)27-14/h7-10H,6H2,1-5H3,(H2,22,23,24,25)
US Patent
n/an/a<30n/an/an/an/an/an/a
Universita degli Studi di Firenze
Assay Description
Materials: LRRK2 G2019S enzyme Substrate (LRRKtide) ATP TR-FRET dilution buffer pLRRKtide antibody 384-well...
Bioorg Med Chem Lett 18: 2567-73 (2008)
BindingDB Entry DOI: 10.7270/Q29G5Q4M