BDBM197023 US9206164, 87
SMILES: CCc1nn(Cc2ccc(cc2F)-c2nc3cc(Br)ccc3[nH]2)c(CC)c1CC(O)=O
InChI Key: InChIKey=YLBHJQRCNQPOTJ-UHFFFAOYSA-N
Data: 1 KI
Activity Spreadsheet -- Enzyme Inhibition Constant Data from BindingDB
Found 1 hit for monomerid = 197023
Trg + Lig
Ki
nM
ΔG°
kcal/mole
IC50
nM
Kd
nM
EC50/IC50
nM
koff
s-1
kon
M-1s-1
pHTemp
°C
G protein-coupled receptor 44
(Homo sapiens (Human))
BDBM197023
(US9206164, 87)
Show SMILES CCc1nn(Cc2ccc(cc2F)-c2nc3cc(Br)ccc3[nH]2)c(CC)c1CC(O)=O
Show InChI InChI=1S/C23H22BrFN4O2/c1-3-18-16(11-22(30)31)21(4-2)29(28-18)12-14-6-5-13(9-17(14)25)23-26-19-8-7-15(24)10-20(19)27-23/h5-10H,3-4,11-12H2,1-2H3,(H,26,27)(H,30,31)
Reactome pathway
US Patent
0.400n/an/an/an/an/an/a7.4n/a
Boehringer Ingelheim International GmbH
US Patent
Assay Description
The CRTH2 receptor binding assay is performed in a scintillation proximity assay (SPA) format with the radioligand [3H]-PGD2 (Perkin Elmer, NET616000...
US Patent US9206164 (2015)
BindingDB Entry DOI: 10.7270/Q2PR7TS9