BDBM19739 2-Cyano-pyrimidine, 17d::2-cyano-4-[(2,2-dimethylpropyl)amino]-N-{2-[4-(4-methylpiperazin-1-yl)phenyl]ethyl}pyrimidine-5-carboxamide
SMILES: CN1CCN(CC1)c1ccc(CCNC(=O)c2cnc(nc2NCC(C)(C)C)C#N)cc1
InChI Key: InChIKey=RZGXNMYCQHETTM-UHFFFAOYSA-N
Data: 3 IC50
Activity Spreadsheet -- Enzyme Inhibition Constant Data from BindingDB
Found 3 hits for monomerid = 19739
Trg + Lig
Ki
nM
ΔG°
kcal/mole
IC50
nM
Kd
nM
EC50/IC50
nM
koff
s-1
kon
M-1s-1
pHTemp
°C
Cathepsin K
(Homo sapiens (Human))
BDBM19739
(2-Cyano-pyrimidine, 17d | 2-cyano-4-[(2,2-dimethyl...)
Show SMILES CN1CCN(CC1)c1ccc(CCNC(=O)c2cnc(nc2NCC(C)(C)C)C#N)cc1
Show InChI InChI=1S/C24H33N7O/c1-24(2,3)17-28-22-20(16-27-21(15-25)29-22)23(32)26-10-9-18-5-7-19(8-6-18)31-13-11-30(4)12-14-31/h5-8,16H,9-14,17H2,1-4H3,(H,26,32)(H,27,28,29)
Reactome pathway
n/an/a 0.0250n/an/an/an/a7.022
Novartis Pharmaceuticals
Assay Description
The substrate hydrolysis with or without inhibitor was monitored at an excitation wavelength of 360nm and an emission wavelength of 460 nm on a fluor...
J Med Chem 50: 591-4 (2007)
Article DOI: 10.1021/jm0613525
BindingDB Entry DOI: 10.7270/Q22805X5
Cathepsin S
(Homo sapiens (Human))
BDBM19739
(2-Cyano-pyrimidine, 17d | 2-cyano-4-[(2,2-dimethyl...)
Show SMILES CN1CCN(CC1)c1ccc(CCNC(=O)c2cnc(nc2NCC(C)(C)C)C#N)cc1
Show InChI InChI=1S/C24H33N7O/c1-24(2,3)17-28-22-20(16-27-21(15-25)29-22)23(32)26-10-9-18-5-7-19(8-6-18)31-13-11-30(4)12-14-31/h5-8,16H,9-14,17H2,1-4H3,(H,26,32)(H,27,28,29)
Reactome pathway
n/an/a 3.10n/an/an/an/an/an/a
Novartis Pharmaceuticals
Assay Description
The substrate hydrolysis with or without inhibitor was monitored at an excitation wavelength of 360nm and an emission wavelength of 460 nm on a fluor...
J Med Chem 50: 591-4 (2007)
Article DOI: 10.1021/jm0613525
BindingDB Entry DOI: 10.7270/Q22805X5
Procathepsin L
(Homo sapiens (Human))
BDBM19739
(2-Cyano-pyrimidine, 17d | 2-cyano-4-[(2,2-dimethyl...)
Show SMILES CN1CCN(CC1)c1ccc(CCNC(=O)c2cnc(nc2NCC(C)(C)C)C#N)cc1
Show InChI InChI=1S/C24H33N7O/c1-24(2,3)17-28-22-20(16-27-21(15-25)29-22)23(32)26-10-9-18-5-7-19(8-6-18)31-13-11-30(4)12-14-31/h5-8,16H,9-14,17H2,1-4H3,(H,26,32)(H,27,28,29)
Reactome pathway
n/an/a 3.90n/an/an/an/a5.522
Novartis Pharmaceuticals
Assay Description
The substrate hydrolysis with or without inhibitor was monitored at an excitation wavelength of 360nm and an emission wavelength of 460 nm on a fluor...
J Med Chem 50: 591-4 (2007)
Article DOI: 10.1021/jm0613525
BindingDB Entry DOI: 10.7270/Q22805X5