BDBM1976 13-amino-9-methyl-2-oxa-9-azatricyclo[9.4.0.0^{3,8}]pentadeca-1(15),3,5,7,11,13-hexaen-10-one::Dibenzoxazepinone 19
SMILES: CN1c2ccccc2Oc2ccc(N)cc2C1=O
InChI Key: InChIKey=SOZVMXIKFABVBR-UHFFFAOYSA-N
Data: 1 IC50
Activity Spreadsheet -- Enzyme Inhibition Constant Data from BindingDB
Found 1 hit for monomerid = 1976
Trg + Lig
Ki
nM
ΔG°
kcal/mole
IC50
nM
Kd
nM
EC50/IC50
nM
koff
s-1
kon
M-1s-1
pHTemp
°C
HIV-1 Reverse Transcriptase
(Human immunodeficiency virus type 1)
BDBM1976
(13-amino-9-methyl-2-oxa-9-azatricyclo[9.4.0.0^{3,8...)
Show SMILES CN1c2ccccc2Oc2ccc(N)cc2C1=O
Show InChI InChI=1S/C14H12N2O2/c1-16-11-4-2-3-5-13(11)18-12-7-6-9(15)8-10(12)14(16)17/h2-8H,15H2,1H3
n/an/a 180n/an/an/an/a7.822
Boehringer Ingelheim Pharmaceuticals Inc.
Assay Description
The IC50 of reverse transcriptase is the concentration that inhibits 50% of recombinant HIV-1 RT RNA-directed DNA polymerase activity in vitro.
J Med Chem 35: 1887-97 (1992)
Article DOI: 10.1021/jm00088a027
BindingDB Entry DOI: 10.7270/Q2ST7N0J