BDBM19830 (1R,2R)-N-(cyanomethyl)-2-{[(3-hydroxyphenyl)sulfanyl]methyl}cyclohexane-1-carboxamide::Cyclohexanecarboxamide derivative, 12n::racemic mixture
SMILES: Oc1cccc(SC[C@@H]2CCCC[C@H]2C(=O)NCC#N)c1
InChI Key: InChIKey=ZZMQUHKNSLYCST-SWLSCSKDSA-N
Data: 1 IC50
Activity Spreadsheet -- Enzyme Inhibition Constant Data from BindingDB
Found 1 hit for monomerid = 19830
Trg + Lig
Ki
nM
ΔG°
kcal/mole
IC50
nM
Kd
nM
EC50/IC50
nM
koff
s-1
kon
M-1s-1
pHTemp
°C
Cathepsin K
(Oryctolagus cuniculus (rabbit))
BDBM19830
((1R,2R)-N-(cyanomethyl)-2-{[(3-hydroxyphenyl)sulfa...)
Show SMILES Oc1cccc(SC[C@@H]2CCCC[C@H]2C(=O)NCC#N)c1 |r|
Show InChI InChI=1S/C16H20N2O2S/c17-8-9-18-16(20)15-7-2-1-4-12(15)11-21-14-6-3-5-13(19)10-14/h3,5-6,10,12,15,19H,1-2,4,7,9,11H2,(H,18,20)/t12-,15+/m0/s1
n/an/a 330n/an/an/an/a5.522
Merck Frosst Centre for Therapeutic Research
Assay Description
Prior to the addition of substrate, different concentrations of the inhibitor ranging from 100 uM to 0.2 nM were preincubated for 15 min with enzyme ...
J Med Chem 49: 1066-79 (2006)
Article DOI: 10.1021/jm051059p
BindingDB Entry DOI: 10.7270/Q2DF6PH3