null
SMILES: Cc1ccc(CN2CCC(N3CCC(CC3)c3ccc(O)cc3)C2=O)cc1
InChI Key: InChIKey=ILUHFPBBZNEUNW-UHFFFAOYSA-N
Activity Spreadsheet -- Enzyme Inhibition Constant Data from BindingDB
Found 1 hit for monomerid = 198692
Trg + Lig
Ki
nM
ΔG°
kcal/mole
IC50
nM
Kd
nM
EC50/IC50
nM
koff
s-1
kon
M-1s-1
pHTemp
°C
Glutamate receptor ionotropic, NMDA 2B
(Rattus norvegicus (Rat))
BDBM198692
(US9221796, 22)
Show SMILES Cc1ccc(CN2CCC(N3CCC(CC3)c3ccc(O)cc3)C2=O)cc1
Show InChI InChI=1S/C23H28N2O2/c1-17-2-4-18(5-3-17)16-25-15-12-22(23(25)27)24-13-10-20(11-14-24)19-6-8-21(26)9-7-19/h2-9,20,22,26H,10-16H2,1H3
US Patent
2.90 -12.6n/an/an/an/an/an/a50
Bristol-Myers Squibb Company
US Patent
Assay Description
To perform the competition binding assay, thawed membrane homogenate was added to each well of a 96-well plate (20 ug/well). The experimental compo...
US Patent US9221796 (2015)
BindingDB Entry DOI: 10.7270/Q20V8BK1