null
SMILES: Cc1ccc(CN2CC[C@@H](N3CC[C@@H]([C@@H](F)C3)c3ccc(O)c(F)c3)C2=O)cc1F
InChI Key: InChIKey=YPQRZBTXPBZJBN-JRGCBEDISA-N
Activity Spreadsheet -- Enzyme Inhibition Constant Data from BindingDB
Found 1 hit for monomerid = 198724
Trg + Lig
Ki
nM
ΔG°
kcal/mole
IC50
nM
Kd
nM
EC50/IC50
nM
koff
s-1
kon
M-1s-1
pHTemp
°C
Glutamate receptor ionotropic, NMDA 2B
(Rattus norvegicus (Rat))
BDBM198724
(US9221796, 45, P-4)
Show SMILES Cc1ccc(CN2CC[C@@H](N3CC[C@@H]([C@@H](F)C3)c3ccc(O)c(F)c3)C2=O)cc1F |r|
Show InChI InChI=1S/C23H25F3N2O2/c1-14-2-3-15(10-18(14)24)12-28-9-7-21(23(28)30)27-8-6-17(20(26)13-27)16-4-5-22(29)19(25)11-16/h2-5,10-11,17,20-21,29H,6-9,12-13H2,1H3/t17-,20+,21-/m1/s1
US Patent
2.5 -12.7n/an/an/an/an/an/a50
Bristol-Myers Squibb Company
US Patent
Assay Description
To perform the competition binding assay, thawed membrane homogenate was added to each well of a 96-well plate (20 ug/well). The experimental compo...
US Patent US9221796 (2015)
BindingDB Entry DOI: 10.7270/Q20V8BK1