BDBM198726 US9221796, 46, P-2
SMILES: Cc1ccc(CN2CC[C@@H](N3CC[C@@H]([C@@H](F)C3)c3ccc(O)cc3)C2=O)cc1
InChI Key: InChIKey=UNVYDSCXINFREZ-BHIFYINESA-N
Data: 2 KI  1 IC50
Activity Spreadsheet -- Enzyme Inhibition Constant Data from BindingDB
Found 3 hits for monomerid = 198726
Trg + Lig
Ki
nM
ΔG°
kcal/mole
IC50
nM
Kd
nM
EC50/IC50
nM
koff
s-1
kon
M-1s-1
pHTemp
°C
Glutamate receptor ionotropic, NMDA 2B
(Rattus norvegicus (Rat))
BDBM198726
(US9221796, 46, P-2)
Show SMILES Cc1ccc(CN2CC[C@@H](N3CC[C@@H]([C@@H](F)C3)c3ccc(O)cc3)C2=O)cc1 |r|
Show InChI InChI=1S/C23H27FN2O2/c1-16-2-4-17(5-3-16)14-26-13-11-22(23(26)28)25-12-10-20(21(24)15-25)18-6-8-19(27)9-7-18/h2-9,20-22,27H,10-15H2,1H3/t20-,21+,22-/m1/s1
US Patent
4.30 -12.4n/an/an/an/an/an/a50
Bristol-Myers Squibb Company
US Patent
Assay Description
To perform the competition binding assay, thawed membrane homogenate was added to each well of a 96-well plate (20 ug/well). The experimental compo...
US Patent US9221796 (2015)
BindingDB Entry DOI: 10.7270/Q20V8BK1
Glutamate receptor ionotropic, NMDA 2B
(Rattus norvegicus (Rat))
BDBM198726
(US9221796, 46, P-2)
Show SMILES Cc1ccc(CN2CC[C@@H](N3CC[C@@H]([C@@H](F)C3)c3ccc(O)cc3)C2=O)cc1 |r|
Show InChI InChI=1S/C23H27FN2O2/c1-16-2-4-17(5-3-16)14-26-13-11-22(23(26)28)25-12-10-20(21(24)15-25)18-6-8-19(27)9-7-18/h2-9,20-22,27H,10-15H2,1H3/t20-,21+,22-/m1/s1
4.30n/an/an/an/an/an/an/an/a
Bristol-Myers Squibb Research and Development
Curated by ChEMBL
Assay Description
Displacement of [3H]Ro 25-6981 from GluN2B receptor in Sprague-Dawley rat forebrain membranes incubated for 1 hr by topcount micro scintillation coun...
ACS Med Chem Lett 9: 472-477 (2018)
Article DOI: 10.1021/acsmedchemlett.8b00080
BindingDB Entry DOI: 10.7270/Q2PR7ZJT
Potassium voltage-gated channel subfamily H member 2
(Homo sapiens (Human))
BDBM198726
(US9221796, 46, P-2)
Show SMILES Cc1ccc(CN2CC[C@@H](N3CC[C@@H]([C@@H](F)C3)c3ccc(O)cc3)C2=O)cc1 |r|
Show InChI InChI=1S/C23H27FN2O2/c1-16-2-4-17(5-3-16)14-26-13-11-22(23(26)28)25-12-10-20(21(24)15-25)18-6-8-19(27)9-7-18/h2-9,20-22,27H,10-15H2,1H3/t20-,21+,22-/m1/s1
Reactome pathway
n/an/a>3.00E+4n/an/an/an/an/an/a
Bristol-Myers Squibb Research and Development
Curated by ChEMBL
Assay Description
Inhibition of human ERG expressed in HEK293 cells assessed as reduction in peak tail current after 2 to 5 mins by patch clamp based electrophysiology...
ACS Med Chem Lett 9: 472-477 (2018)
Article DOI: 10.1021/acsmedchemlett.8b00080
BindingDB Entry DOI: 10.7270/Q2PR7ZJT