BDBM198844 US9221797, 7
SMILES: NC(=O)CCc1ccc(NC(=O)c2nc(c[nH]2)C#N)c(c1)C1=CCCCC1
InChI Key: InChIKey=VMGGYSQUCLDMQG-UHFFFAOYSA-N
Data: 1 IC50
Activity Spreadsheet -- Enzyme Inhibition Constant Data from BindingDB
Found 1 hit for monomerid = 198844
Trg + Lig
Ki
nM
ΔG°
kcal/mole
IC50
nM
Kd
nM
EC50/IC50
nM
koff
s-1
kon
M-1s-1
pHTemp
°C
FMS Substrate Peptide (aa 555-568)
(Homo sapiens (Human))
BDBM198844
(US9221797, 7)
Show SMILES NC(=O)CCc1ccc(NC(=O)c2nc(c[nH]2)C#N)c(c1)C1=CCCCC1 |t:23|
Show InChI InChI=1S/C20H21N5O2/c21-11-15-12-23-19(24-15)20(27)25-17-8-6-13(7-9-18(22)26)10-16(17)14-4-2-1-3-5-14/h4,6,8,10,12H,1-3,5,7,9H2,(H2,22,26)(H,23,24)(H,25,27)
US Patent
n/an/a 2.70n/an/an/an/a7.5n/a
Janssen Pharmaceutica NV
US Patent
Assay Description
A fluorescence polarization competition immunoassay was used to measure compound inhibition of CSF-1R phosphorylation of tyrosine on a synthetic CS...
US Patent US9221797 (2015)
BindingDB Entry DOI: 10.7270/Q2W37V4H