BDBM198914 US9221802, Ref. Ex. 103::US9315498, 103
SMILES: O=C1O[C@H]2CCC[C@H]2CN1c1ccc(cn1)C#Cc1ccccc1
InChI Key: InChIKey=SATNCABEKXHUKZ-ROUUACIJSA-N
Data: 2 EC50
Activity Spreadsheet -- Enzyme Inhibition Constant Data from BindingDB
Found 2 hits for monomerid = 198914
Trg + Lig
Ki
nM
ΔG°
kcal/mole
IC50
nM
Kd
nM
EC50/IC50
nM
koff
s-1
kon
M-1s-1
pHTemp
°C
Metabotropic glutamate receptor 5a (mGluR5)
(Homo sapiens (Human))
BDBM198914
(US9221802, Ref. Ex. 103 | US9315498, 103)
Show SMILES O=C1O[C@H]2CCC[C@H]2CN1c1ccc(cn1)C#Cc1ccccc1 |r|
Show InChI InChI=1S/C20H18N2O2/c23-20-22(14-17-7-4-8-18(17)24-20)19-12-11-16(13-21-19)10-9-15-5-2-1-3-6-15/h1-3,5-6,11-13,17-18H,4,7-8,14H2/t17-,18-/m0/s1
US Patent
n/an/an/an/a 27n/an/an/a37
HOFFMAN-LA ROCHE INC.
US Patent
Assay Description
A monoclonal HEK-293 cell line stably transfected with a cDNA encoding for the human mGlu5a receptor was generated; for the work with mGlu5 Positive ...
US Patent US9315498 (2016)
BindingDB Entry DOI: 10.7270/Q23T9G2X
Metabotropic glutamate receptor 5a (mGluR5)
(Homo sapiens (Human))
BDBM198914
(US9221802, Ref. Ex. 103 | US9315498, 103)
Show SMILES O=C1O[C@H]2CCC[C@H]2CN1c1ccc(cn1)C#Cc1ccccc1 |r|
Show InChI InChI=1S/C20H18N2O2/c23-20-22(14-17-7-4-8-18(17)24-20)19-12-11-16(13-21-19)10-9-15-5-2-1-3-6-15/h1-3,5-6,11-13,17-18H,4,7-8,14H2/t17-,18-/m0/s1
US Patent
n/an/an/an/a 27n/an/an/a37
Hoffman-La Roche Inc.
US Patent
Assay Description
About 24 hrs before an experiment, 5x104 cells/well were seeded in poly-D-lysine coated, black/clear-bottomed 96-well plates. The cells were loaded...
US Patent US9221802 (2015)
BindingDB Entry DOI: 10.7270/Q2RF5SVJ