BDBM1991 5,7,9-trimethyl-2-oxa-9-azatricyclo[9.4.0.0^{3,8}]pentadeca-1(15),3,5,7,11,13-hexaen-10-one::Dibenzoxazepinone 42
SMILES: CN1c2c(C)cc(C)cc2Oc2ccccc2C1=O
InChI Key: InChIKey=OWQJVODOCWCIPX-UHFFFAOYSA-N
Data: 1 IC50
Activity Spreadsheet -- Enzyme Inhibition Constant Data from BindingDB
Found 1 hit for monomerid = 1991
Trg + Lig
Ki
nM
ΔG°
kcal/mole
IC50
nM
Kd
nM
EC50/IC50
nM
koff
s-1
kon
M-1s-1
pHTemp
°C
HIV-1 Reverse Transcriptase
(Human immunodeficiency virus type 1)
BDBM1991
(5,7,9-trimethyl-2-oxa-9-azatricyclo[9.4.0.0^{3,8}]...)
Show SMILES CN1c2c(C)cc(C)cc2Oc2ccccc2C1=O
Show InChI InChI=1S/C16H15NO2/c1-10-8-11(2)15-14(9-10)19-13-7-5-4-6-12(13)16(18)17(15)3/h4-9H,1-3H3
n/an/a 57n/an/an/an/a7.822
Boehringer Ingelheim Pharmaceuticals Inc.
Assay Description
The IC50 of reverse transcriptase is the concentration that inhibits 50% of recombinant HIV-1 RT RNA-directed DNA polymerase activity in vitro.
J Med Chem 35: 1887-97 (1992)
Article DOI: 10.1021/jm00088a027
BindingDB Entry DOI: 10.7270/Q2ST7N0J