BDBM199122 N-(4-(1-(4,6-bis(phenylamino)-1,3,5-triazin-2-yl)-5-(4-methoxyphenyl)-1H-pyrazol-3-yl)phenyl)-4-methylbenzenesulphonamide (8d)
SMILES: COc1ccc(cc1)-c1cc(nn1-c1nc(Nc2ccccc2)nc(Nc2ccccc2)n1)-c1ccc(NS(=O)(=O)c2ccc(C)cc2)cc1
InChI Key: InChIKey=KJZKKSNBWCXOIP-UHFFFAOYSA-N
Data: 2 IC50
Activity Spreadsheet -- Enzyme Inhibition Constant Data from BindingDB
Found 2 hits for monomerid = 199122
Trg + Lig
Ki
nM
ΔG°
kcal/mole
IC50
nM
Kd
nM
EC50/IC50
nM
koff
s-1
kon
M-1s-1
pHTemp
°C
Matrix metalloproteinase-9 (MMP-9)
(Rattus norvegicus (Rat))
BDBM199122
(N-(4-(1-(4,6-bis(phenylamino)-1,3,5-triazin-2-yl)-...)
Show SMILES COc1ccc(cc1)-c1cc(nn1-c1nc(Nc2ccccc2)nc(Nc2ccccc2)n1)-c1ccc(NS(=O)(=O)c2ccc(C)cc2)cc1
Show InChI InChI=1S/C38H32N8O3S/c1-26-13-23-33(24-14-26)50-49-48-45-31-19-15-27(16-20-31)34-25-35(28-17-21-32(47-2)22-18-28)46(44-34)38-42-36(39-29-9-5-3-6-10-29)41-37(43-38)40-30-11-7-4-8-12-30/h3-25,45H,1-2H3,(H2,39,40,41,42,43)
n/an/a 105n/an/an/an/a7.525
Zhejiang Hospital
Assay Description
where a pro-fluorescing peptide is used as substrate, and the fluorogenic activity of its cleavage product is measured after co-incubation with the a...
Chem Biol Drug Des 88: 756-765 (2016)
Article DOI: 10.1111/cbdd.12807
BindingDB Entry DOI: 10.7270/Q2ZW1JR4
Matrix metalloproteinase-2 (MMP-2)
(Rattus norvegicus (Rat))
BDBM199122
(N-(4-(1-(4,6-bis(phenylamino)-1,3,5-triazin-2-yl)-...)
Show SMILES COc1ccc(cc1)-c1cc(nn1-c1nc(Nc2ccccc2)nc(Nc2ccccc2)n1)-c1ccc(NS(=O)(=O)c2ccc(C)cc2)cc1
Show InChI InChI=1S/C38H32N8O3S/c1-26-13-23-33(24-14-26)50-49-48-45-31-19-15-27(16-20-31)34-25-35(28-17-21-32(47-2)22-18-28)46(44-34)38-42-36(39-29-9-5-3-6-10-29)41-37(43-38)40-30-11-7-4-8-12-30/h3-25,45H,1-2H3,(H2,39,40,41,42,43)
n/an/a 123n/an/an/an/a7.525
Zhejiang Hospital
Assay Description
where a pro-fluorescing peptide is used as substrate, and the fluorogenic activity of its cleavage product is measured after co-incubation with the a...
Chem Biol Drug Des 88: 756-765 (2016)
Article DOI: 10.1111/cbdd.12807
BindingDB Entry DOI: 10.7270/Q2ZW1JR4