BDBM199130 2-(2-Methyl-5-nitro-1H-imidazol-1-yl)-ethyl-1,5-di-p-tolyl-1H-pyrazole-3-carboxylate (4b)
SMILES: Cc1ncc(n1CCOC(=O)c1cc(-c2ccc(C)cc2)n(n1)-c1ccc(C)cc1)[N+]([O-])=O
InChI Key: InChIKey=WXCCKPQJMBPDPB-UHFFFAOYSA-N
Data: 1 IC50
Activity Spreadsheet -- Enzyme Inhibition Constant Data from BindingDB
Found 1 hit for monomerid = 199130
Trg + Lig
Ki
nM
ΔG°
kcal/mole
IC50
nM
Kd
nM
EC50/IC50
nM
koff
s-1
kon
M-1s-1
pHTemp
°C
Tyrosyl-tRNA synthetase (TryRS)
(Staphylococcus aureus (Firmicutes))
BDBM199130
(2-(2-Methyl-5-nitro-1H-imidazol-1-yl)-ethyl-1,5-di...)
Show SMILES Cc1ncc(n1CCOC(=O)c1cc(-c2ccc(C)cc2)n(n1)-c1ccc(C)cc1)[N+]([O-])=O
Show InChI InChI=1S/C24H23N5O4/c1-16-4-8-19(9-5-16)22-14-21(26-28(22)20-10-6-17(2)7-11-20)24(30)33-13-12-27-18(3)25-15-23(27)29(31)32/h4-11,14-15H,12-13H2,1-3H3
n/an/a 3.19E+4n/an/an/an/a7.9n/a
Nanjing University
Assay Description
The assays were conducted at 37 °C in a mixture containing 100 mM Tris/Cl pH 7.9, 50 mM KCl, 16 mM MgCl2, 5 mM ATP, 3 mM DTT, 4 mg/ml E. coli MRE600 ...
Chem Biol Drug Des 88: 592-8 (2016)
Article DOI: 10.1111/cbdd.12793
BindingDB Entry DOI: 10.7270/Q2V69HDF