null
SMILES: FC(F)(F)c1c(CCCOc2ccccc2)n2CCOc3cccc1c23
InChI Key: InChIKey=GQJAQFVKDDQPJQ-UHFFFAOYSA-N
Activity Spreadsheet -- Enzyme Inhibition Constant Data from BindingDB
Found 2 hits for monomerid = 199229
Trg + Lig
Ki
nM
ΔG°
kcal/mole
IC50
nM
Kd
nM
EC50/IC50
nM
koff
s-1
kon
M-1s-1
pHTemp
°C
Endothelial lipase
(Mus musculus (Mouse))
BDBM199229
(US9216998, 27)
Show SMILES FC(F)(F)c1c(CCCOc2ccccc2)n2CCOc3cccc1c23
Show InChI InChI=1S/C20H18F3NO2/c21-20(22,23)18-15-8-4-10-17-19(15)24(11-13-26-17)16(18)9-5-12-25-14-6-2-1-3-7-14/h1-4,6-8,10H,5,9,11-13H2
US Patent
n/an/a 108n/an/an/an/a7.2n/a
Janssen Pharmaceutica NV
US Patent
Assay Description
To assay for cell surface lipase activity, cells expressing human endothelial lipase (EL) or LPL were plated in CellBIND® 384-well plates (Corning, L...
US Patent US9216998 (2015)
BindingDB Entry DOI: 10.7270/Q22N513F
Endothelial lipase
(Homo sapiens (Human))
BDBM199229
(US9216998, 27)
Show SMILES FC(F)(F)c1c(CCCOc2ccccc2)n2CCOc3cccc1c23
Show InChI InChI=1S/C20H18F3NO2/c21-20(22,23)18-15-8-4-10-17-19(15)24(11-13-26-17)16(18)9-5-12-25-14-6-2-1-3-7-14/h1-4,6-8,10H,5,9,11-13H2
US Patent
n/an/a 82n/an/an/an/a7.2n/a
Janssen Pharmaceutica NV
US Patent
Assay Description
To assay for cell surface lipase activity, cells expressing human endothelial lipase (EL) or LPL were plated in CellBIND® 384-well plates (Corning, L...
US Patent US9216998 (2015)
BindingDB Entry DOI: 10.7270/Q22N513F