BDBM199361 US9221831, 26
SMILES: COc1ccc2C[C@H]3N(CC4CC4)CC[C@@]45[C@@H](Oc1c24)[C@]1(CC[C@@]35C[C@@H]1COCc1c(C)noc1C)OC
InChI Key: InChIKey=SUKLBCXGVCYVGS-RRRALXMPSA-N
Data: 4 KI  3 EC50
Activity Spreadsheet -- Enzyme Inhibition Constant Data from BindingDB
Found 7 hits for monomerid = 199361
Trg + Lig
Ki
nM
ΔG°
kcal/mole
IC50
nM
Kd
nM
EC50/IC50
nM
koff
s-1
kon
M-1s-1
pHTemp
°C
Kappa-type opioid receptor
(Homo sapiens (Human))
BDBM199361
(US9221831, 26)
Show SMILES COc1ccc2C[C@H]3N(CC4CC4)CC[C@@]45[C@@H](Oc1c24)[C@]1(CC[C@@]35C[C@@H]1COCc1c(C)noc1C)OC |r,THB:26:25:15.16:22.21|
Show InChI InChI=1S/C31H40N2O5/c1-18-23(19(2)38-32-18)17-36-16-22-14-29-9-10-31(22,35-4)28-30(29)11-12-33(15-20-5-6-20)25(29)13-21-7-8-24(34-3)27(37-28)26(21)30/h7-8,20,22,25,28H,5-6,9-17H2,1-4H3/t22-,25-,28-,29-,30+,31-/m1/s1
Reactome pathway
US Patent
0.150n/an/an/an/an/an/a7.4n/a
Purdue Pharma, L.P.
US Patent
Assay Description
Radioligand dose displacement assays used 0.4 nM [3H]-U69,593 (GE Healthcare, Piscataway, N.J.; 40 Ci/mmole) with 15 μg membrane protein (recomb...
US Patent US9221831 (2015)
BindingDB Entry DOI: 10.7270/Q2T72G8M
Mu-type opioid receptor
(Homo sapiens (Human))
BDBM199361
(US9221831, 26)
Show SMILES COc1ccc2C[C@H]3N(CC4CC4)CC[C@@]45[C@@H](Oc1c24)[C@]1(CC[C@@]35C[C@@H]1COCc1c(C)noc1C)OC |r,THB:26:25:15.16:22.21|
Show InChI InChI=1S/C31H40N2O5/c1-18-23(19(2)38-32-18)17-36-16-22-14-29-9-10-31(22,35-4)28-30(29)11-12-33(15-20-5-6-20)25(29)13-21-7-8-24(34-3)27(37-28)26(21)30/h7-8,20,22,25,28H,5-6,9-17H2,1-4H3/t22-,25-,28-,29-,30+,31-/m1/s1
NCI pathway
Reactome pathway
US Patent
92.7 -10.4n/an/an/an/an/a7.450
Purdue Pharma, L.P.
US Patent
Assay Description
Radioligand dose-displacement binding assays for t-opioid receptors used 0.3 nM [3H]-diprenorphine (Perkin Elmer, Shelton, Conn.), with 5 mg membrane...
US Patent US9221831 (2015)
BindingDB Entry DOI: 10.7270/Q2T72G8M
Delta-type opioid receptor
(Homo sapiens (Human))
BDBM199361
(US9221831, 26)
Show SMILES COc1ccc2C[C@H]3N(CC4CC4)CC[C@@]45[C@@H](Oc1c24)[C@]1(CC[C@@]35C[C@@H]1COCc1c(C)noc1C)OC |r,THB:26:25:15.16:22.21|
Show InChI InChI=1S/C31H40N2O5/c1-18-23(19(2)38-32-18)17-36-16-22-14-29-9-10-31(22,35-4)28-30(29)11-12-33(15-20-5-6-20)25(29)13-21-7-8-24(34-3)27(37-28)26(21)30/h7-8,20,22,25,28H,5-6,9-17H2,1-4H3/t22-,25-,28-,29-,30+,31-/m1/s1
Reactome pathway
US Patent
180 -9.19n/an/an/an/an/a7.425
Purdue Pharma, L.P.
US Patent
Assay Description
Delta-opioid Receptor Binding Assay Procedures were conducted as follows. Radioligand dose-displacement assays used 0.3 nM [3H]-Naltrindole (Perkin...
US Patent US9221831 (2015)
BindingDB Entry DOI: 10.7270/Q2T72G8M
Opioid growth factor receptor-like protein 1
(Homo sapiens (Human))
BDBM199361
(US9221831, 26)
Show SMILES COc1ccc2C[C@H]3N(CC4CC4)CC[C@@]45[C@@H](Oc1c24)[C@]1(CC[C@@]35C[C@@H]1COCc1c(C)noc1C)OC |r,THB:26:25:15.16:22.21|
Show InChI InChI=1S/C31H40N2O5/c1-18-23(19(2)38-32-18)17-36-16-22-14-29-9-10-31(22,35-4)28-30(29)11-12-33(15-20-5-6-20)25(29)13-21-7-8-24(34-3)27(37-28)26(21)30/h7-8,20,22,25,28H,5-6,9-17H2,1-4H3/t22-,25-,28-,29-,30+,31-/m1/s1
US Patent
6.40E+3 -7.67n/an/an/an/an/a7.450
Purdue Pharma, L.P.
US Patent
Assay Description
Radioligand binding assays (screening and dose-displacement) used 0.1 nM [3H]-nociceptin (Perkin Elmer, Shelton, Conn.; 87.7 Ci/mmole) with 12 ug mem...
US Patent US9221831 (2015)
BindingDB Entry DOI: 10.7270/Q2T72G8M
Delta-type opioid receptor
(Homo sapiens (Human))
BDBM199361
(US9221831, 26)
Show SMILES COc1ccc2C[C@H]3N(CC4CC4)CC[C@@]45[C@@H](Oc1c24)[C@]1(CC[C@@]35C[C@@H]1COCc1c(C)noc1C)OC |r,THB:26:25:15.16:22.21|
Show InChI InChI=1S/C31H40N2O5/c1-18-23(19(2)38-32-18)17-36-16-22-14-29-9-10-31(22,35-4)28-30(29)11-12-33(15-20-5-6-20)25(29)13-21-7-8-24(34-3)27(37-28)26(21)30/h7-8,20,22,25,28H,5-6,9-17H2,1-4H3/t22-,25-,28-,29-,30+,31-/m1/s1
Reactome pathway
US Patent
n/an/an/an/a 229n/an/a7.425
Purdue Pharma, L.P.
US Patent
Assay Description
Functional [35S]GTPgammaS binding assays were conducted as follows. Delta opioid receptor membrane solution was prepared by sequentially adding fin...
US Patent US9221831 (2015)
BindingDB Entry DOI: 10.7270/Q2T72G8M
Mu-type opioid receptor
(Homo sapiens (Human))
BDBM199361
(US9221831, 26)
Show SMILES COc1ccc2C[C@H]3N(CC4CC4)CC[C@@]45[C@@H](Oc1c24)[C@]1(CC[C@@]35C[C@@H]1COCc1c(C)noc1C)OC |r,THB:26:25:15.16:22.21|
Show InChI InChI=1S/C31H40N2O5/c1-18-23(19(2)38-32-18)17-36-16-22-14-29-9-10-31(22,35-4)28-30(29)11-12-33(15-20-5-6-20)25(29)13-21-7-8-24(34-3)27(37-28)26(21)30/h7-8,20,22,25,28H,5-6,9-17H2,1-4H3/t22-,25-,28-,29-,30+,31-/m1/s1
NCI pathway
Reactome pathway
US Patent
n/an/an/an/a 127n/an/a7.425
Purdue Pharma, L.P.
US Patent
Assay Description
[35S]GTPgammaS functional assays were conducted using freshly thawed u-receptor membranes (Perkin Elmer, Shelton, Conn.). Assay reactions were prepa...
US Patent US9221831 (2015)
BindingDB Entry DOI: 10.7270/Q2T72G8M
Kappa-type opioid receptor
(Homo sapiens (Human))
BDBM199361
(US9221831, 26)
Show SMILES COc1ccc2C[C@H]3N(CC4CC4)CC[C@@]45[C@@H](Oc1c24)[C@]1(CC[C@@]35C[C@@H]1COCc1c(C)noc1C)OC |r,THB:26:25:15.16:22.21|
Show InChI InChI=1S/C31H40N2O5/c1-18-23(19(2)38-32-18)17-36-16-22-14-29-9-10-31(22,35-4)28-30(29)11-12-33(15-20-5-6-20)25(29)13-21-7-8-24(34-3)27(37-28)26(21)30/h7-8,20,22,25,28H,5-6,9-17H2,1-4H3/t22-,25-,28-,29-,30+,31-/m1/s1
Reactome pathway
US Patent
n/an/an/an/a 21.1n/an/a7.425
Purdue Pharma, L.P.
US Patent
Assay Description
Functional [35S]GTPgammaS binding assays were conducted as follows. κ opioid receptor membrane solution was prepared by sequentially adding final ...
US Patent US9221831 (2015)
BindingDB Entry DOI: 10.7270/Q2T72G8M