BDBM199787 US9226922, 423
SMILES: C[C@@H](O)[C@@H](NC(=O)Nc1cc2[nH]nc(OCCOC(F)F)c2cn1)c1ccccc1
InChI Key:
Data: 1 IC50
Activity Spreadsheet -- Enzyme Inhibition Constant Data from BindingDB
Found 1 hit for monomerid = 199787
Trg + Lig
Ki
nM
ΔG°
kcal/mole
IC50
nM
Kd
nM
EC50/IC50
nM
koff
s-1
kon
M-1s-1
pHTemp
°C
Mitogen-activated protein kinase 1
(Homo sapiens (Human))
BDBM199787
(US9226922, 423)
Show SMILES C[C@@H](O)[C@@H](NC(=O)Nc1cc2[nH]nc(OCCOC(F)F)c2cn1)c1ccccc1 |r|
NCI pathway
Reactome pathway
US Patent
n/an/a 0.600n/an/an/an/an/an/a
Merck Sharp & Dohme Corp.
US Patent
Assay Description
Activated ERK2 activity was determined in an IMAP-FP assay (Molecular Devices). Using this assay format, the potency (IC50) of each compound was dete...
US Patent US9226922 (2016)
BindingDB Entry DOI: 10.7270/Q2PG1QJW