BDBM199820 US9226922, 456::US9226922, 573
SMILES: CCOc1n[nH]c2cc(NC(=O)N[C@@H](c3ccc(F)cc3)C(C)(C)O)ncc12
InChI Key:
Data: 2 IC50
Activity Spreadsheet -- Enzyme Inhibition Constant Data from BindingDB
Found 2 hits for monomerid = 199820
Trg + Lig
Ki
nM
ΔG°
kcal/mole
IC50
nM
Kd
nM
EC50/IC50
nM
koff
s-1
kon
M-1s-1
pHTemp
°C
Mitogen-activated protein kinase 1
(Homo sapiens (Human))
BDBM199820
(US9226922, 456 | US9226922, 573)
Show SMILES CCOc1n[nH]c2cc(NC(=O)N[C@@H](c3ccc(F)cc3)C(C)(C)O)ncc12 |r|
NCI pathway
Reactome pathway
US Patent
n/an/a 0.700n/an/an/an/an/an/a
Merck Sharp & Dohme Corp.
US Patent
Assay Description
Activated ERK2 activity was determined in an IMAP-FP assay (Molecular Devices). Using this assay format, the potency (IC50) of each compound was dete...
US Patent US9226922 (2016)
BindingDB Entry DOI: 10.7270/Q2PG1QJW
Mitogen-activated protein kinase 1
(Homo sapiens (Human))
BDBM199820
(US9226922, 456 | US9226922, 573)
Show SMILES CCOc1n[nH]c2cc(NC(=O)N[C@@H](c3ccc(F)cc3)C(C)(C)O)ncc12 |r|
NCI pathway
Reactome pathway
US Patent
n/an/a 0.5n/an/an/an/an/an/a
Merck Sharp & Dohme Corp.
US Patent
Assay Description
Activated ERK2 activity was determined in an IMAP-FP assay (Molecular Devices). Using this assay format, the potency (IC50) of each compound was dete...
US Patent US9226922 (2016)
BindingDB Entry DOI: 10.7270/Q2PG1QJW